| Summary: | efibootpartition.GenericEFITest.test_boot_efi selftest failed | ||
|---|---|---|---|
| Product: | [Build System, Metadata & Runtime] OE-Core | Reporter: | Richard Purdie <richard.purdie> |
| Component: | core | Assignee: | Unassigned <unassigned> |
| Status: | RESOLVED OBSOLETE | QA Contact: | |
| Severity: | normal | ||
| Priority: | Medium | CC: | alexandre.belloni, anuj.mittal, kexin.hao, luca.ceresoli, meta.mr.watcher, meta.watcher, randy.macleod, tim.orling |
| Version: | 3.2 | ||
| Target Milestone: | 5.99 | ||
| Hardware: | x86 | ||
| OS: | Multiple | ||
| Whiteboard: | AB-INT AB-FREQUENT | ||
| OS type for building Yocto: | --- | Type of Regression: | --- |
| Verified: | Documentation change: | No (bug/feature does not impact docs) | |
|
Description
Richard Purdie
2020-08-21 06:21:35 UTC
Happened again with a failure efibootpartition.GenericEFITest.test_boot_efi on ubuntu1804-ty-3: https://autobuilder.yoctoproject.org/typhoon/#/builders/87/builds/1475/steps/8/logs/step2d Chee Yang, can you take a look into this bug for the 3.3 development cycle? tried on ubuntu 18.04.5, centos8, opensuse 15.2 and fedora 32 in VM, no luck to reproduce this. I got this again while building gatesgarth: https://autobuilder.yoctoproject.org/typhoon/#/builders/87/builds/1590/steps/10/logs/step2d https://autobuilder.yoctoproject.org/typhoon/#/builders/80/builds/2189/steps/15/logs/stdio oe-selftest-debian debian9-ty-2 This doesn't happen very often but we've seen it for years. Perhaps the QMP debugging will help. Chee any comments or ideas? https://autobuilder.yoctoproject.org/typhoon/#/builders/86/builds/2575/steps/14/logs/stdio oe-selftest-fedora fedora33-ty-1 https://autobuilder.yoctoproject.org/typhoon/#/builders/86/builds/2970/steps/14/logs/stdio oe-selftest-fedora fedora34-ty-1 fedora35-ty-2 SSD master-next https://autobuilder.yoctoproject.org/typhoon/#/builders/86/builds/3226/steps/14/logs/stdio https://autobuilder.yoctoproject.org/typhoon/#/builders/86/builds/3257/steps/14/logs/stdio oe-selftest-fedora fedora35-ty-2 https://autobuilder.yoctoproject.org/typhoon/#/builders/79/builds/3342/steps/14/logs/stdio oe-selftest-centos centos8-ty-1 https://autobuilder.yoctoproject.org/typhoon/#builders/86/builds/3342/steps/14/logs/stdio oe-selftest-fedora fedora34-ty-1 https://autobuilder.yoctoproject.org/typhoon/#builders/79/builds/3373/steps/14/logs/stdio oe-selftest-centos centos8-ty-1 Does anyone have an idea about how to add debugging logs to gain more understanding of this bug? Can anyone add debugging logs to gain more understanding of this bug? Not all that frequent but it does happen a fair bit and it should be fixed sooner than other AB bugs. https://autobuilder.yoctoproject.org/typhoon/#/builders/86/builds/3978/steps/14/logs/stdio Couldn't get the logs out of this one: Waiting at most 1000 seconds for login banner (08/19/22 12:32:01) Connection from 127.0.0.1:37612 Target didn't reach login banner in 1000 seconds (08/19/22 12:48:41) 2022-08-19 12:48:42,170 - oe-selftest - INFO - 7: 4/28 227/498 (1801.77s) (efibootpartition.GenericEFITest.test_boot_efi) 2022-08-19 12:48:42,170 - oe-selftest - INFO - testtools.testresult.real._StringException: Traceback (most recent call last): File "/home/pokybuild/yocto-worker/oe-selftest-fedora/build/meta/lib/oeqa/utils/commands.py", line 350, in runqemu qemu.start(params=qemuparams, ssh=ssh, runqemuparams=runqemuparams, launch_cmd=launch_cmd, discard_writes=discard_writes) File "/home/pokybuild/yocto-worker/oe-selftest-fedora/build/meta/lib/oeqa/targetcontrol.py", line 172, in start start = self.runner.launch(get_ip=ssh, launch_cmd=launch_cmd, qemuparams=params) File "/home/pokybuild/yocto-worker/oe-selftest-fedora/build/meta/lib/oeqa/utils/qemurunner.py", line 490, in launch bootlog = bootlog.decode("utf-8") UnicodeDecodeError: 'utf-8' codec can't decode byte 0xc4 in position 528: invalid continuation byte During handling of the above exception, another exception occurred: Traceback (most recent call last): File "/home/pokybuild/yocto-worker/oe-selftest-fedora/build/meta/lib/oeqa/selftest/cases/efibootpartition.py", line 45, in test_boot_efi with runqemu(self.image, ssh=False, launch_cmd=cmd) as qemu: File "/usr/lib64/python3.10/contextlib.py", line 135, in __enter__ return next(self.gen) File "/home/pokybuild/yocto-worker/oe-selftest-fedora/build/meta/lib/oeqa/utils/commands.py", line 356, in runqemu raise Exception(msg) Exception: 'utf-8' codec can't decode byte 0xc4 in position 528: invalid continuation byte https://autobuilder.yoctoproject.org/typhoon/#/builders/127/builds/231/steps/14/logs/stdio oe-selftest-armhost on ubuntu2004-arm-1 https://autobuilder.yoctoproject.org/typhoon/#/builders/87/builds/4240/steps/14/logs/stdio oe-selftest-ubuntu ubuntu2204-ty-2 Build move to 5.0 -- ../Randy Bulk move from 5.0* to 5.99 to indicate that there isn't any one available to work on this issue. We want to resolve this issue so if anyone sees the issue again, please re-open it and gather as much relevant data as you can. |