Bug 1409

Summary: x32: lttng-ust build fails
Product: [Build System, Metadata & Runtime] OE-Core Reporter: Nitin Kamble <nitin.a.kamble>
Component: coreAssignee: Nitin Kamble <nitin.a.kamble>
Status: RESOLVED WORKSFORME QA Contact:
Severity: normal    
Priority: Medium CC: hjl.tools, meta.mr.watcher, meta.watcher
Version: unspecified   
Target Milestone: 1.2   
Hardware: x86   
OS: x86_64   
Whiteboard:
OS type for building Yocto: --- Type of Regression: ---
Verified: Documentation change: ---
Bug Depends on:    
Bug Blocks: 1579    

Description Nitin Kamble 2011-08-25 14:32:29 UTC
ERROR: Function 'do_install' failed (see /disk0/pokybuild/build-multilib-x32-qemu/tmp/work/x86_64-x32-poky-linux-gnux32/lttng-ust-0.15-r2/temp/log.do_install.7456 for further information)
ERROR: Logfile of failure stored in: /disk0/pokybuild/build-multilib-x32-qemu/tmp/work/x86_64-x32-poky-linux-gnux32/lttng-ust-0.15-r2/temp/log.do_install.7456
Log data follows:
| DEBUG: SITE files ['endian-little', 'common-linux', 'common-glibc', 'bit-32', 'ix86-common', 'x86_64-linux-gnux32', 'common']
| NOTE: make DESTDIR=/disk0/pokybuild/build-multilib-x32-qemu/tmp/work/x86_64-x32-poky-linux-gnux32/lttng-ust-0.15-r2/image install
| Making install in snprintf
| make[1]: Entering directory `/disk0/pokybuild/build-multilib-x32-qemu/tmp/work/x86_64-x32-poky-linux-gnux32/lttng-ust-0.15-r2/ust-0.15/snprintf'
| make[2]: Entering directory `/disk0/pokybuild/build-multilib-x32-qemu/tmp/work/x86_64-x32-poky-linux-gnux32/lttng-ust-0.15-r2/ust-0.15/snprintf'
| make[2]: Nothing to be done for `install-exec-am'.
| make[2]: Nothing to be done for `install-data-am'.
| make[2]: Leaving directory `/disk0/pokybuild/build-multilib-x32-qemu/tmp/work/x86_64-x32-poky-linux-gnux32/lttng-ust-0.15-r2/ust-0.15/snprintf'
| make[1]: Leaving directory `/disk0/pokybuild/build-multilib-x32-qemu/tmp/work/x86_64-x32-poky-linux-gnux32/lttng-ust-0.15-r2/ust-0.15/snprintf'
| Making install in libustcomm
| make[1]: Entering directory `/disk0/pokybuild/build-multilib-x32-qemu/tmp/work/x86_64-x32-poky-linux-gnux32/lttng-ust-0.15-r2/ust-0.15/libustcomm'
| make[2]: Entering directory `/disk0/pokybuild/build-multilib-x32-qemu/tmp/work/x86_64-x32-poky-linux-gnux32/lttng-ust-0.15-r2/ust-0.15/libustcomm'
| make[2]: Nothing to be done for `install-exec-am'.
| make[2]: Nothing to be done for `install-data-am'.
| make[2]: Leaving directory `/disk0/pokybuild/build-multilib-x32-qemu/tmp/work/x86_64-x32-poky-linux-gnux32/lttng-ust-0.15-r2/ust-0.15/libustcomm'
| make[1]: Leaving directory `/disk0/pokybuild/build-multilib-x32-qemu/tmp/work/x86_64-x32-poky-linux-gnux32/lttng-ust-0.15-r2/ust-0.15/libustcomm'
| Making install in libustctl
| make[1]: Entering directory `/disk0/pokybuild/build-multilib-x32-qemu/tmp/work/x86_64-x32-poky-linux-gnux32/lttng-ust-0.15-r2/ust-0.15/libustctl'
| make[2]: Entering directory `/disk0/pokybuild/build-multilib-x32-qemu/tmp/work/x86_64-x32-poky-linux-gnux32/lttng-ust-0.15-r2/ust-0.15/libustctl'
| test -z "/usr/lib" || /bin/mkdir -p "/disk0/pokybuild/build-multilib-x32-qemu/tmp/work/x86_64-x32-poky-linux-gnux32/lttng-ust-0.15-r2/image/usr/lib"
|  /bin/sh ../x86_64-poky-linux-gnux32-libtool   --mode=install /usr/bin/install -c   libustctl.la '/disk0/pokybuild/build-multilib-x32-qemu/tmp/work/x86_64-x32-poky-linux-gnux32/lttng-ust-0.15-r2/image/usr/lib'
| x86_64-poky-linux-gnux32-libtool: install: /usr/bin/install -c .libs/libustctl.so.0.0.0 /disk0/pokybuild/build-multilib-x32-qemu/tmp/work/x86_64-x32-poky-linux-gnux32/lttng-ust-0.15-r2/image/usr/lib/libustctl.so.0.0.0
| x86_64-poky-linux-gnux32-libtool: install: (cd /disk0/pokybuild/build-multilib-x32-qemu/tmp/work/x86_64-x32-poky-linux-gnux32/lttng-ust-0.15-r2/image/usr/lib && { ln -s -f libustctl.so.0.0.0 libustctl.so.0 || { rm -f libustctl.so.0 && ln -s libustctl.so.0.0.0 libustctl.so.0; }; })
| x86_64-poky-linux-gnux32-libtool: install: (cd /disk0/pokybuild/build-multilib-x32-qemu/tmp/work/x86_64-x32-poky-linux-gnux32/lttng-ust-0.15-r2/image/usr/lib && { ln -s -f libustctl.so.0.0.0 libustctl.so || { rm -f libustctl.so && ln -s libustctl.so.0.0.0 libustctl.so; }; })
| x86_64-poky-linux-gnux32-libtool: install: /usr/bin/install -c .libs/libustctl.lai /disk0/pokybuild/build-multilib-x32-qemu/tmp/work/x86_64-x32-poky-linux-gnux32/lttng-ust-0.15-r2/image/usr/lib/libustctl.la
| x86_64-poky-linux-gnux32-libtool: install: /usr/bin/install -c .libs/libustctl.a /disk0/pokybuild/build-multilib-x32-qemu/tmp/work/x86_64-x32-poky-linux-gnux32/lttng-ust-0.15-r2/image/usr/lib/libustctl.a
| x86_64-poky-linux-gnux32-libtool: install: chmod 644 /disk0/pokybuild/build-multilib-x32-qemu/tmp/work/x86_64-x32-poky-linux-gnux32/lttng-ust-0.15-r2/image/usr/lib/libustctl.a
| x86_64-poky-linux-gnux32-libtool: install: x86_64-poky-linux-gnux32-ranlib /disk0/pokybuild/build-multilib-x32-qemu/tmp/work/x86_64-x32-poky-linux-gnux32/lttng-ust-0.15-r2/image/usr/lib/libustctl.a
| x86_64-poky-linux-gnux32-libtool: install: warning: remember to run `x86_64-poky-linux-gnux32-libtool --finish /usr/lib'
| make[2]: Nothing to be done for `install-data-am'.
| make[2]: Leaving directory `/disk0/pokybuild/build-multilib-x32-qemu/tmp/work/x86_64-x32-poky-linux-gnux32/lttng-ust-0.15-r2/ust-0.15/libustctl'
| make[1]: Leaving directory `/disk0/pokybuild/build-multilib-x32-qemu/tmp/work/x86_64-x32-poky-linux-gnux32/lttng-ust-0.15-r2/ust-0.15/libustctl'
| Making install in libust
| make[1]: Entering directory `/disk0/pokybuild/build-multilib-x32-qemu/tmp/work/x86_64-x32-poky-linux-gnux32/lttng-ust-0.15-r2/ust-0.15/libust'
| make[2]: Entering directory `/disk0/pokybuild/build-multilib-x32-qemu/tmp/work/x86_64-x32-poky-linux-gnux32/lttng-ust-0.15-r2/ust-0.15/libust'
| test -z "/usr/lib" || /bin/mkdir -p "/disk0/pokybuild/build-multilib-x32-qemu/tmp/work/x86_64-x32-poky-linux-gnux32/lttng-ust-0.15-r2/image/usr/lib"
|  /bin/sh ../x86_64-poky-linux-gnux32-libtool   --mode=install /usr/bin/install -c   libust.la '/disk0/pokybuild/build-multilib-x32-qemu/tmp/work/x86_64-x32-poky-linux-gnux32/lttng-ust-0.15-r2/image/usr/lib'
| x86_64-poky-linux-gnux32-libtool: install: /usr/bin/install -c .libs/libust.so.0.0.0 /disk0/pokybuild/build-multilib-x32-qemu/tmp/work/x86_64-x32-poky-linux-gnux32/lttng-ust-0.15-r2/image/usr/lib/libust.so.0.0.0
| x86_64-poky-linux-gnux32-libtool: install: (cd /disk0/pokybuild/build-multilib-x32-qemu/tmp/work/x86_64-x32-poky-linux-gnux32/lttng-ust-0.15-r2/image/usr/lib && { ln -s -f libust.so.0.0.0 libust.so.0 || { rm -f libust.so.0 && ln -s libust.so.0.0.0 libust.so.0; }; })
| x86_64-poky-linux-gnux32-libtool: install: (cd /disk0/pokybuild/build-multilib-x32-qemu/tmp/work/x86_64-x32-poky-linux-gnux32/lttng-ust-0.15-r2/image/usr/lib && { ln -s -f libust.so.0.0.0 libust.so || { rm -f libust.so && ln -s libust.so.0.0.0 libust.so; }; })
| x86_64-poky-linux-gnux32-libtool: install: /usr/bin/install -c .libs/libust.lai /disk0/pokybuild/build-multilib-x32-qemu/tmp/work/x86_64-x32-poky-linux-gnux32/lttng-ust-0.15-r2/image/usr/lib/libust.la
| x86_64-poky-linux-gnux32-libtool: install: /usr/bin/install -c .libs/libust.a /disk0/pokybuild/build-multilib-x32-qemu/tmp/work/x86_64-x32-poky-linux-gnux32/lttng-ust-0.15-r2/image/usr/lib/libust.a
| x86_64-poky-linux-gnux32-libtool: install: chmod 644 /disk0/pokybuild/build-multilib-x32-qemu/tmp/work/x86_64-x32-poky-linux-gnux32/lttng-ust-0.15-r2/image/usr/lib/libust.a
| x86_64-poky-linux-gnux32-libtool: install: x86_64-poky-linux-gnux32-ranlib /disk0/pokybuild/build-multilib-x32-qemu/tmp/work/x86_64-x32-poky-linux-gnux32/lttng-ust-0.15-r2/image/usr/lib/libust.a
| x86_64-poky-linux-gnux32-libtool: install: warning: remember to run `x86_64-poky-linux-gnux32-libtool --finish /usr/lib'
| make[2]: Nothing to be done for `install-data-am'.
| make[2]: Leaving directory `/disk0/pokybuild/build-multilib-x32-qemu/tmp/work/x86_64-x32-poky-linux-gnux32/lttng-ust-0.15-r2/ust-0.15/libust'
| make[1]: Leaving directory `/disk0/pokybuild/build-multilib-x32-qemu/tmp/work/x86_64-x32-poky-linux-gnux32/lttng-ust-0.15-r2/ust-0.15/libust'
| Making install in .
| make[1]: Entering directory `/disk0/pokybuild/build-multilib-x32-qemu/tmp/work/x86_64-x32-poky-linux-gnux32/lttng-ust-0.15-r2/ust-0.15'
| make[2]: Entering directory `/disk0/pokybuild/build-multilib-x32-qemu/tmp/work/x86_64-x32-poky-linux-gnux32/lttng-ust-0.15-r2/ust-0.15'
| test -z "/usr/bin" || /bin/mkdir -p "/disk0/pokybuild/build-multilib-x32-qemu/tmp/work/x86_64-x32-poky-linux-gnux32/lttng-ust-0.15-r2/image/usr/bin"
|  /usr/bin/install -c usttrace '/disk0/pokybuild/build-multilib-x32-qemu/tmp/work/x86_64-x32-poky-linux-gnux32/lttng-ust-0.15-r2/image/usr/bin'
| test -z "/usr/lib" || /bin/mkdir -p "/disk0/pokybuild/build-multilib-x32-qemu/tmp/work/x86_64-x32-poky-linux-gnux32/lttng-ust-0.15-r2/image/usr/lib"
|  /usr/bin/install -c -m 644 libust.so libust-initializer.o '/disk0/pokybuild/build-multilib-x32-qemu/tmp/work/x86_64-x32-poky-linux-gnux32/lttng-ust-0.15-r2/image/usr/lib'
| test -z "/usr/lib/pkgconfig" || /bin/mkdir -p "/disk0/pokybuild/build-multilib-x32-qemu/tmp/work/x86_64-x32-poky-linux-gnux32/lttng-ust-0.15-r2/image/usr/lib/pkgconfig"
|  /usr/bin/install -c -m 644 ust.pc '/disk0/pokybuild/build-multilib-x32-qemu/tmp/work/x86_64-x32-poky-linux-gnux32/lttng-ust-0.15-r2/image/usr/lib/pkgconfig'
| make[2]: Leaving directory `/disk0/pokybuild/build-multilib-x32-qemu/tmp/work/x86_64-x32-poky-linux-gnux32/lttng-ust-0.15-r2/ust-0.15'
| make[1]: Leaving directory `/disk0/pokybuild/build-multilib-x32-qemu/tmp/work/x86_64-x32-poky-linux-gnux32/lttng-ust-0.15-r2/ust-0.15'
| Making install in tests
| make[1]: Entering directory `/disk0/pokybuild/build-multilib-x32-qemu/tmp/work/x86_64-x32-poky-linux-gnux32/lttng-ust-0.15-r2/ust-0.15/tests'
| Making install in .
| make[2]: Entering directory `/disk0/pokybuild/build-multilib-x32-qemu/tmp/work/x86_64-x32-poky-linux-gnux32/lttng-ust-0.15-r2/ust-0.15/tests'
| make[3]: Entering directory `/disk0/pokybuild/build-multilib-x32-qemu/tmp/work/x86_64-x32-poky-linux-gnux32/lttng-ust-0.15-r2/ust-0.15/tests'
| make[3]: Nothing to be done for `install-exec-am'.
| make[3]: Nothing to be done for `install-data-am'.
| make[3]: Leaving directory `/disk0/pokybuild/build-multilib-x32-qemu/tmp/work/x86_64-x32-poky-linux-gnux32/lttng-ust-0.15-r2/ust-0.15/tests'
| make[2]: Leaving directory `/disk0/pokybuild/build-multilib-x32-qemu/tmp/work/x86_64-x32-poky-linux-gnux32/lttng-ust-0.15-r2/ust-0.15/tests'
| Making install in hello
| make[2]: Entering directory `/disk0/pokybuild/build-multilib-x32-qemu/tmp/work/x86_64-x32-poky-linux-gnux32/lttng-ust-0.15-r2/ust-0.15/tests/hello'
| make[3]: Entering directory `/disk0/pokybuild/build-multilib-x32-qemu/tmp/work/x86_64-x32-poky-linux-gnux32/lttng-ust-0.15-r2/ust-0.15/tests/hello'
| make[3]: Nothing to be done for `install-exec-am'.
| make[3]: Nothing to be done for `install-data-am'.
| make[3]: Leaving directory `/disk0/pokybuild/build-multilib-x32-qemu/tmp/work/x86_64-x32-poky-linux-gnux32/lttng-ust-0.15-r2/ust-0.15/tests/hello'
| make[2]: Leaving directory `/disk0/pokybuild/build-multilib-x32-qemu/tmp/work/x86_64-x32-poky-linux-gnux32/lttng-ust-0.15-r2/ust-0.15/tests/hello'
| Making install in hello2
| make[2]: Entering directory `/disk0/pokybuild/build-multilib-x32-qemu/tmp/work/x86_64-x32-poky-linux-gnux32/lttng-ust-0.15-r2/ust-0.15/tests/hello2'
| make[3]: Entering directory `/disk0/pokybuild/build-multilib-x32-qemu/tmp/work/x86_64-x32-poky-linux-gnux32/lttng-ust-0.15-r2/ust-0.15/tests/hello2'
| make[3]: Nothing to be done for `install-exec-am'.
| make[3]: Nothing to be done for `install-data-am'.
| make[3]: Leaving directory `/disk0/pokybuild/build-multilib-x32-qemu/tmp/work/x86_64-x32-poky-linux-gnux32/lttng-ust-0.15-r2/ust-0.15/tests/hello2'
| make[2]: Leaving directory `/disk0/pokybuild/build-multilib-x32-qemu/tmp/work/x86_64-x32-poky-linux-gnux32/lttng-ust-0.15-r2/ust-0.15/tests/hello2'
| Making install in basic
| make[2]: Entering directory `/disk0/pokybuild/build-multilib-x32-qemu/tmp/work/x86_64-x32-poky-linux-gnux32/lttng-ust-0.15-r2/ust-0.15/tests/basic'
| make[3]: Entering directory `/disk0/pokybuild/build-multilib-x32-qemu/tmp/work/x86_64-x32-poky-linux-gnux32/lttng-ust-0.15-r2/ust-0.15/tests/basic'
| make[3]: Nothing to be done for `install-exec-am'.
| make[3]: Nothing to be done for `install-data-am'.
| make[3]: Leaving directory `/disk0/pokybuild/build-multilib-x32-qemu/tmp/work/x86_64-x32-poky-linux-gnux32/lttng-ust-0.15-r2/ust-0.15/tests/basic'
| make[2]: Leaving directory `/disk0/pokybuild/build-multilib-x32-qemu/tmp/work/x86_64-x32-poky-linux-gnux32/lttng-ust-0.15-r2/ust-0.15/tests/basic'
| Making install in basic_long
| make[2]: Entering directory `/disk0/pokybuild/build-multilib-x32-qemu/tmp/work/x86_64-x32-poky-linux-gnux32/lttng-ust-0.15-r2/ust-0.15/tests/basic_long'
| make[3]: Entering directory `/disk0/pokybuild/build-multilib-x32-qemu/tmp/work/x86_64-x32-poky-linux-gnux32/lttng-ust-0.15-r2/ust-0.15/tests/basic_long'
| make[3]: Nothing to be done for `install-exec-am'.
| make[3]: Nothing to be done for `install-data-am'.
| make[3]: Leaving directory `/disk0/pokybuild/build-multilib-x32-qemu/tmp/work/x86_64-x32-poky-linux-gnux32/lttng-ust-0.15-r2/ust-0.15/tests/basic_long'
| make[2]: Leaving directory `/disk0/pokybuild/build-multilib-x32-qemu/tmp/work/x86_64-x32-poky-linux-gnux32/lttng-ust-0.15-r2/ust-0.15/tests/basic_long'
| Making install in fork
| make[2]: Entering directory `/disk0/pokybuild/build-multilib-x32-qemu/tmp/work/x86_64-x32-poky-linux-gnux32/lttng-ust-0.15-r2/ust-0.15/tests/fork'
| make[3]: Entering directory `/disk0/pokybuild/build-multilib-x32-qemu/tmp/work/x86_64-x32-poky-linux-gnux32/lttng-ust-0.15-r2/ust-0.15/tests/fork'
| make[3]: Nothing to be done for `install-exec-am'.
| make[3]: Nothing to be done for `install-data-am'.
| make[3]: Leaving directory `/disk0/pokybuild/build-multilib-x32-qemu/tmp/work/x86_64-x32-poky-linux-gnux32/lttng-ust-0.15-r2/ust-0.15/tests/fork'
| make[2]: Leaving directory `/disk0/pokybuild/build-multilib-x32-qemu/tmp/work/x86_64-x32-poky-linux-gnux32/lttng-ust-0.15-r2/ust-0.15/tests/fork'
| Making install in simple_include
| make[2]: Entering directory `/disk0/pokybuild/build-multilib-x32-qemu/tmp/work/x86_64-x32-poky-linux-gnux32/lttng-ust-0.15-r2/ust-0.15/tests/simple_include'
| make[3]: Entering directory `/disk0/pokybuild/build-multilib-x32-qemu/tmp/work/x86_64-x32-poky-linux-gnux32/lttng-ust-0.15-r2/ust-0.15/tests/simple_include'
| make[3]: Nothing to be done for `install-exec-am'.
| make[3]: Nothing to be done for `install-data-am'.
| make[3]: Leaving directory `/disk0/pokybuild/build-multilib-x32-qemu/tmp/work/x86_64-x32-poky-linux-gnux32/lttng-ust-0.15-r2/ust-0.15/tests/simple_include'
| make[2]: Leaving directory `/disk0/pokybuild/build-multilib-x32-qemu/tmp/work/x86_64-x32-poky-linux-gnux32/lttng-ust-0.15-r2/ust-0.15/tests/simple_include'
| Making install in snprintf
| make[2]: Entering directory `/disk0/pokybuild/build-multilib-x32-qemu/tmp/work/x86_64-x32-poky-linux-gnux32/lttng-ust-0.15-r2/ust-0.15/tests/snprintf'
| make[3]: Entering directory `/disk0/pokybuild/build-multilib-x32-qemu/tmp/work/x86_64-x32-poky-linux-gnux32/lttng-ust-0.15-r2/ust-0.15/tests/snprintf'
| make[3]: Nothing to be done for `install-exec-am'.
| make[3]: Nothing to be done for `install-data-am'.
| make[3]: Leaving directory `/disk0/pokybuild/build-multilib-x32-qemu/tmp/work/x86_64-x32-poky-linux-gnux32/lttng-ust-0.15-r2/ust-0.15/tests/snprintf'
| make[2]: Leaving directory `/disk0/pokybuild/build-multilib-x32-qemu/tmp/work/x86_64-x32-poky-linux-gnux32/lttng-ust-0.15-r2/ust-0.15/tests/snprintf'
| Making install in test-nevents
| make[2]: Entering directory `/disk0/pokybuild/build-multilib-x32-qemu/tmp/work/x86_64-x32-poky-linux-gnux32/lttng-ust-0.15-r2/ust-0.15/tests/test-nevents'
| make[3]: Entering directory `/disk0/pokybuild/build-multilib-x32-qemu/tmp/work/x86_64-x32-poky-linux-gnux32/lttng-ust-0.15-r2/ust-0.15/tests/test-nevents'
| make[3]: Nothing to be done for `install-exec-am'.
| make[3]: Nothing to be done for `install-data-am'.
| make[3]: Leaving directory `/disk0/pokybuild/build-multilib-x32-qemu/tmp/work/x86_64-x32-poky-linux-gnux32/lttng-ust-0.15-r2/ust-0.15/tests/test-nevents'
| make[2]: Leaving directory `/disk0/pokybuild/build-multilib-x32-qemu/tmp/work/x86_64-x32-poky-linux-gnux32/lttng-ust-0.15-r2/ust-0.15/tests/test-nevents'
| Making install in test-libustinstr-malloc
| make[2]: Entering directory `/disk0/pokybuild/build-multilib-x32-qemu/tmp/work/x86_64-x32-poky-linux-gnux32/lttng-ust-0.15-r2/ust-0.15/tests/test-libustinstr-malloc'
| make[3]: Entering directory `/disk0/pokybuild/build-multilib-x32-qemu/tmp/work/x86_64-x32-poky-linux-gnux32/lttng-ust-0.15-r2/ust-0.15/tests/test-libustinstr-malloc'
| make[3]: Nothing to be done for `install-exec-am'.
| make[3]: Nothing to be done for `install-data-am'.
| make[3]: Leaving directory `/disk0/pokybuild/build-multilib-x32-qemu/tmp/work/x86_64-x32-poky-linux-gnux32/lttng-ust-0.15-r2/ust-0.15/tests/test-libustinstr-malloc'
| make[2]: Leaving directory `/disk0/pokybuild/build-multilib-x32-qemu/tmp/work/x86_64-x32-poky-linux-gnux32/lttng-ust-0.15-r2/ust-0.15/tests/test-libustinstr-malloc'
| Making install in dlopen
| make[2]: Entering directory `/disk0/pokybuild/build-multilib-x32-qemu/tmp/work/x86_64-x32-poky-linux-gnux32/lttng-ust-0.15-r2/ust-0.15/tests/dlopen'
| make[3]: Entering directory `/disk0/pokybuild/build-multilib-x32-qemu/tmp/work/x86_64-x32-poky-linux-gnux32/lttng-ust-0.15-r2/ust-0.15/tests/dlopen'
| make[3]: Nothing to be done for `install-exec-am'.
| make[3]: Nothing to be done for `install-data-am'.
| make[3]: Leaving directory `/disk0/pokybuild/build-multilib-x32-qemu/tmp/work/x86_64-x32-poky-linux-gnux32/lttng-ust-0.15-r2/ust-0.15/tests/dlopen'
| make[2]: Leaving directory `/disk0/pokybuild/build-multilib-x32-qemu/tmp/work/x86_64-x32-poky-linux-gnux32/lttng-ust-0.15-r2/ust-0.15/tests/dlopen'
| Making install in same_line_marker
| make[2]: Entering directory `/disk0/pokybuild/build-multilib-x32-qemu/tmp/work/x86_64-x32-poky-linux-gnux32/lttng-ust-0.15-r2/ust-0.15/tests/same_line_marker'
| make[3]: Entering directory `/disk0/pokybuild/build-multilib-x32-qemu/tmp/work/x86_64-x32-poky-linux-gnux32/lttng-ust-0.15-r2/ust-0.15/tests/same_line_marker'
| make[3]: Nothing to be done for `install-exec-am'.
| make[3]: Nothing to be done for `install-data-am'.
| make[3]: Leaving directory `/disk0/pokybuild/build-multilib-x32-qemu/tmp/work/x86_64-x32-poky-linux-gnux32/lttng-ust-0.15-r2/ust-0.15/tests/same_line_marker'
| make[2]: Leaving directory `/disk0/pokybuild/build-multilib-x32-qemu/tmp/work/x86_64-x32-poky-linux-gnux32/lttng-ust-0.15-r2/ust-0.15/tests/same_line_marker'
| Making install in trace_event
| make[2]: Entering directory `/disk0/pokybuild/build-multilib-x32-qemu/tmp/work/x86_64-x32-poky-linux-gnux32/lttng-ust-0.15-r2/ust-0.15/tests/trace_event'
| make[3]: Entering directory `/disk0/pokybuild/build-multilib-x32-qemu/tmp/work/x86_64-x32-poky-linux-gnux32/lttng-ust-0.15-r2/ust-0.15/tests/trace_event'
| make[3]: Nothing to be done for `install-exec-am'.
| make[3]: Nothing to be done for `install-data-am'.
| make[3]: Leaving directory `/disk0/pokybuild/build-multilib-x32-qemu/tmp/work/x86_64-x32-poky-linux-gnux32/lttng-ust-0.15-r2/ust-0.15/tests/trace_event'
| make[2]: Leaving directory `/disk0/pokybuild/build-multilib-x32-qemu/tmp/work/x86_64-x32-poky-linux-gnux32/lttng-ust-0.15-r2/ust-0.15/tests/trace_event'
| Making install in register_test
| make[2]: Entering directory `/disk0/pokybuild/build-multilib-x32-qemu/tmp/work/x86_64-x32-poky-linux-gnux32/lttng-ust-0.15-r2/ust-0.15/tests/register_test'
| make[3]: Entering directory `/disk0/pokybuild/build-multilib-x32-qemu/tmp/work/x86_64-x32-poky-linux-gnux32/lttng-ust-0.15-r2/ust-0.15/tests/register_test'
| make[3]: Nothing to be done for `install-exec-am'.
| make[3]: Nothing to be done for `install-data-am'.
| make[3]: Leaving directory `/disk0/pokybuild/build-multilib-x32-qemu/tmp/work/x86_64-x32-poky-linux-gnux32/lttng-ust-0.15-r2/ust-0.15/tests/register_test'
| make[2]: Leaving directory `/disk0/pokybuild/build-multilib-x32-qemu/tmp/work/x86_64-x32-poky-linux-gnux32/lttng-ust-0.15-r2/ust-0.15/tests/register_test'
| Making install in tracepoint
| make[2]: Entering directory `/disk0/pokybuild/build-multilib-x32-qemu/tmp/work/x86_64-x32-poky-linux-gnux32/lttng-ust-0.15-r2/ust-0.15/tests/tracepoint'
| Making install in benchmark
| make[3]: Entering directory `/disk0/pokybuild/build-multilib-x32-qemu/tmp/work/x86_64-x32-poky-linux-gnux32/lttng-ust-0.15-r2/ust-0.15/tests/tracepoint/benchmark'
| make[4]: Entering directory `/disk0/pokybuild/build-multilib-x32-qemu/tmp/work/x86_64-x32-poky-linux-gnux32/lttng-ust-0.15-r2/ust-0.15/tests/tracepoint/benchmark'
| make[4]: Nothing to be done for `install-exec-am'.
| make[4]: Nothing to be done for `install-data-am'.
| make[4]: Leaving directory `/disk0/pokybuild/build-multilib-x32-qemu/tmp/work/x86_64-x32-poky-linux-gnux32/lttng-ust-0.15-r2/ust-0.15/tests/tracepoint/benchmark'
| make[3]: Leaving directory `/disk0/pokybuild/build-multilib-x32-qemu/tmp/work/x86_64-x32-poky-linux-gnux32/lttng-ust-0.15-r2/ust-0.15/tests/tracepoint/benchmark'
| make[3]: Entering directory `/disk0/pokybuild/build-multilib-x32-qemu/tmp/work/x86_64-x32-poky-linux-gnux32/lttng-ust-0.15-r2/ust-0.15/tests/tracepoint'
| make[4]: Entering directory `/disk0/pokybuild/build-multilib-x32-qemu/tmp/work/x86_64-x32-poky-linux-gnux32/lttng-ust-0.15-r2/ust-0.15/tests/tracepoint'
| make[4]: Nothing to be done for `install-exec-am'.
| make[4]: Nothing to be done for `install-data-am'.
| make[4]: Leaving directory `/disk0/pokybuild/build-multilib-x32-qemu/tmp/work/x86_64-x32-poky-linux-gnux32/lttng-ust-0.15-r2/ust-0.15/tests/tracepoint'
| make[3]: Leaving directory `/disk0/pokybuild/build-multilib-x32-qemu/tmp/work/x86_64-x32-poky-linux-gnux32/lttng-ust-0.15-r2/ust-0.15/tests/tracepoint'
| make[2]: Leaving directory `/disk0/pokybuild/build-multilib-x32-qemu/tmp/work/x86_64-x32-poky-linux-gnux32/lttng-ust-0.15-r2/ust-0.15/tests/tracepoint'
| Making install in libustctl_function_tests
| make[2]: Entering directory `/disk0/pokybuild/build-multilib-x32-qemu/tmp/work/x86_64-x32-poky-linux-gnux32/lttng-ust-0.15-r2/ust-0.15/tests/libustctl_function_tests'
| make[3]: Entering directory `/disk0/pokybuild/build-multilib-x32-qemu/tmp/work/x86_64-x32-poky-linux-gnux32/lttng-ust-0.15-r2/ust-0.15/tests/libustctl_function_tests'
| make[3]: Nothing to be done for `install-exec-am'.
| make[3]: Nothing to be done for `install-data-am'.
| make[3]: Leaving directory `/disk0/pokybuild/build-multilib-x32-qemu/tmp/work/x86_64-x32-poky-linux-gnux32/lttng-ust-0.15-r2/ust-0.15/tests/libustctl_function_tests'
| make[2]: Leaving directory `/disk0/pokybuild/build-multilib-x32-qemu/tmp/work/x86_64-x32-poky-linux-gnux32/lttng-ust-0.15-r2/ust-0.15/tests/libustctl_function_tests'
| Making install in exit-fast
| make[2]: Entering directory `/disk0/pokybuild/build-multilib-x32-qemu/tmp/work/x86_64-x32-poky-linux-gnux32/lttng-ust-0.15-r2/ust-0.15/tests/exit-fast'
| make[3]: Entering directory `/disk0/pokybuild/build-multilib-x32-qemu/tmp/work/x86_64-x32-poky-linux-gnux32/lttng-ust-0.15-r2/ust-0.15/tests/exit-fast'
| make[3]: Nothing to be done for `install-exec-am'.
| make[3]: Nothing to be done for `install-data-am'.
| make[3]: Leaving directory `/disk0/pokybuild/build-multilib-x32-qemu/tmp/work/x86_64-x32-poky-linux-gnux32/lttng-ust-0.15-r2/ust-0.15/tests/exit-fast'
| make[2]: Leaving directory `/disk0/pokybuild/build-multilib-x32-qemu/tmp/work/x86_64-x32-poky-linux-gnux32/lttng-ust-0.15-r2/ust-0.15/tests/exit-fast'
| make[1]: Leaving directory `/disk0/pokybuild/build-multilib-x32-qemu/tmp/work/x86_64-x32-poky-linux-gnux32/lttng-ust-0.15-r2/ust-0.15/tests'
| Making install in libustinstr-malloc
| make[1]: Entering directory `/disk0/pokybuild/build-multilib-x32-qemu/tmp/work/x86_64-x32-poky-linux-gnux32/lttng-ust-0.15-r2/ust-0.15/libustinstr-malloc'
| make[2]: Entering directory `/disk0/pokybuild/build-multilib-x32-qemu/tmp/work/x86_64-x32-poky-linux-gnux32/lttng-ust-0.15-r2/ust-0.15/libustinstr-malloc'
| test -z "/usr/lib" || /bin/mkdir -p "/disk0/pokybuild/build-multilib-x32-qemu/tmp/work/x86_64-x32-poky-linux-gnux32/lttng-ust-0.15-r2/image/usr/lib"
|  /bin/sh ../x86_64-poky-linux-gnux32-libtool   --mode=install /usr/bin/install -c   libustinstr-malloc.la '/disk0/pokybuild/build-multilib-x32-qemu/tmp/work/x86_64-x32-poky-linux-gnux32/lttng-ust-0.15-r2/image/usr/lib'
| x86_64-poky-linux-gnux32-libtool: install: /usr/bin/install -c .libs/libustinstr-malloc.so.0.0.0 /disk0/pokybuild/build-multilib-x32-qemu/tmp/work/x86_64-x32-poky-linux-gnux32/lttng-ust-0.15-r2/image/usr/lib/libustinstr-malloc.so.0.0.0
| x86_64-poky-linux-gnux32-libtool: install: (cd /disk0/pokybuild/build-multilib-x32-qemu/tmp/work/x86_64-x32-poky-linux-gnux32/lttng-ust-0.15-r2/image/usr/lib && { ln -s -f libustinstr-malloc.so.0.0.0 libustinstr-malloc.so.0 || { rm -f libustinstr-malloc.so.0 && ln -s libustinstr-malloc.so.0.0.0 libustinstr-malloc.so.0; }; })
| x86_64-poky-linux-gnux32-libtool: install: (cd /disk0/pokybuild/build-multilib-x32-qemu/tmp/work/x86_64-x32-poky-linux-gnux32/lttng-ust-0.15-r2/image/usr/lib && { ln -s -f libustinstr-malloc.so.0.0.0 libustinstr-malloc.so || { rm -f libustinstr-malloc.so && ln -s libustinstr-malloc.so.0.0.0 libustinstr-malloc.so; }; })
| x86_64-poky-linux-gnux32-libtool: install: /usr/bin/install -c .libs/libustinstr-malloc.lai /disk0/pokybuild/build-multilib-x32-qemu/tmp/work/x86_64-x32-poky-linux-gnux32/lttng-ust-0.15-r2/image/usr/lib/libustinstr-malloc.la
| x86_64-poky-linux-gnux32-libtool: install: /usr/bin/install -c .libs/libustinstr-malloc.a /disk0/pokybuild/build-multilib-x32-qemu/tmp/work/x86_64-x32-poky-linux-gnux32/lttng-ust-0.15-r2/image/usr/lib/libustinstr-malloc.a
| x86_64-poky-linux-gnux32-libtool: install: chmod 644 /disk0/pokybuild/build-multilib-x32-qemu/tmp/work/x86_64-x32-poky-linux-gnux32/lttng-ust-0.15-r2/image/usr/lib/libustinstr-malloc.a
| x86_64-poky-linux-gnux32-libtool: install: x86_64-poky-linux-gnux32-ranlib /disk0/pokybuild/build-multilib-x32-qemu/tmp/work/x86_64-x32-poky-linux-gnux32/lttng-ust-0.15-r2/image/usr/lib/libustinstr-malloc.a
| x86_64-poky-linux-gnux32-libtool: install: warning: remember to run `x86_64-poky-linux-gnux32-libtool --finish /usr/lib'
| make[2]: Nothing to be done for `install-data-am'.
| make[2]: Leaving directory `/disk0/pokybuild/build-multilib-x32-qemu/tmp/work/x86_64-x32-poky-linux-gnux32/lttng-ust-0.15-r2/ust-0.15/libustinstr-malloc'
| make[1]: Leaving directory `/disk0/pokybuild/build-multilib-x32-qemu/tmp/work/x86_64-x32-poky-linux-gnux32/lttng-ust-0.15-r2/ust-0.15/libustinstr-malloc'
| Making install in libustconsumer
| make[1]: Entering directory `/disk0/pokybuild/build-multilib-x32-qemu/tmp/work/x86_64-x32-poky-linux-gnux32/lttng-ust-0.15-r2/ust-0.15/libustconsumer'
| make[2]: Entering directory `/disk0/pokybuild/build-multilib-x32-qemu/tmp/work/x86_64-x32-poky-linux-gnux32/lttng-ust-0.15-r2/ust-0.15/libustconsumer'
| test -z "/usr/lib" || /bin/mkdir -p "/disk0/pokybuild/build-multilib-x32-qemu/tmp/work/x86_64-x32-poky-linux-gnux32/lttng-ust-0.15-r2/image/usr/lib"
|  /bin/sh ../x86_64-poky-linux-gnux32-libtool   --mode=install /usr/bin/install -c   libustconsumer.la '/disk0/pokybuild/build-multilib-x32-qemu/tmp/work/x86_64-x32-poky-linux-gnux32/lttng-ust-0.15-r2/image/usr/lib'
| x86_64-poky-linux-gnux32-libtool: install: /usr/bin/install -c .libs/libustconsumer.so.0.0.0 /disk0/pokybuild/build-multilib-x32-qemu/tmp/work/x86_64-x32-poky-linux-gnux32/lttng-ust-0.15-r2/image/usr/lib/libustconsumer.so.0.0.0
| x86_64-poky-linux-gnux32-libtool: install: (cd /disk0/pokybuild/build-multilib-x32-qemu/tmp/work/x86_64-x32-poky-linux-gnux32/lttng-ust-0.15-r2/image/usr/lib && { ln -s -f libustconsumer.so.0.0.0 libustconsumer.so.0 || { rm -f libustconsumer.so.0 && ln -s libustconsumer.so.0.0.0 libustconsumer.so.0; }; })
| x86_64-poky-linux-gnux32-libtool: install: (cd /disk0/pokybuild/build-multilib-x32-qemu/tmp/work/x86_64-x32-poky-linux-gnux32/lttng-ust-0.15-r2/image/usr/lib && { ln -s -f libustconsumer.so.0.0.0 libustconsumer.so || { rm -f libustconsumer.so && ln -s libustconsumer.so.0.0.0 libustconsumer.so; }; })
| x86_64-poky-linux-gnux32-libtool: install: /usr/bin/install -c .libs/libustconsumer.lai /disk0/pokybuild/build-multilib-x32-qemu/tmp/work/x86_64-x32-poky-linux-gnux32/lttng-ust-0.15-r2/image/usr/lib/libustconsumer.la
| x86_64-poky-linux-gnux32-libtool: install: /usr/bin/install -c .libs/libustconsumer.a /disk0/pokybuild/build-multilib-x32-qemu/tmp/work/x86_64-x32-poky-linux-gnux32/lttng-ust-0.15-r2/image/usr/lib/libustconsumer.a
| x86_64-poky-linux-gnux32-libtool: install: chmod 644 /disk0/pokybuild/build-multilib-x32-qemu/tmp/work/x86_64-x32-poky-linux-gnux32/lttng-ust-0.15-r2/image/usr/lib/libustconsumer.a
| x86_64-poky-linux-gnux32-libtool: install: x86_64-poky-linux-gnux32-ranlib /disk0/pokybuild/build-multilib-x32-qemu/tmp/work/x86_64-x32-poky-linux-gnux32/lttng-ust-0.15-r2/image/usr/lib/libustconsumer.a
| x86_64-poky-linux-gnux32-libtool: install: warning: remember to run `x86_64-poky-linux-gnux32-libtool --finish /usr/lib'
| make[2]: Nothing to be done for `install-data-am'.
| make[2]: Leaving directory `/disk0/pokybuild/build-multilib-x32-qemu/tmp/work/x86_64-x32-poky-linux-gnux32/lttng-ust-0.15-r2/ust-0.15/libustconsumer'
| make[1]: Leaving directory `/disk0/pokybuild/build-multilib-x32-qemu/tmp/work/x86_64-x32-poky-linux-gnux32/lttng-ust-0.15-r2/ust-0.15/libustconsumer'
| Making install in ust-consumerd
| make[1]: Entering directory `/disk0/pokybuild/build-multilib-x32-qemu/tmp/work/x86_64-x32-poky-linux-gnux32/lttng-ust-0.15-r2/ust-0.15/ust-consumerd'
| make[2]: Entering directory `/disk0/pokybuild/build-multilib-x32-qemu/tmp/work/x86_64-x32-poky-linux-gnux32/lttng-ust-0.15-r2/ust-0.15/ust-consumerd'
| test -z "/usr/bin" || /bin/mkdir -p "/disk0/pokybuild/build-multilib-x32-qemu/tmp/work/x86_64-x32-poky-linux-gnux32/lttng-ust-0.15-r2/image/usr/bin"
|   /bin/sh ../x86_64-poky-linux-gnux32-libtool   --mode=install /usr/bin/install -c ust-consumerd '/disk0/pokybuild/build-multilib-x32-qemu/tmp/work/x86_64-x32-poky-linux-gnux32/lttng-ust-0.15-r2/image/usr/bin'
| x86_64-poky-linux-gnux32-libtool: install: warning: `../libustconsumer/libustconsumer.la' has not been installed in `/usr/lib'
| x86_64-poky-linux-gnux32-libtool: install: /usr/bin/install -c .libs/ust-consumerd /disk0/pokybuild/build-multilib-x32-qemu/tmp/work/x86_64-x32-poky-linux-gnux32/lttng-ust-0.15-r2/image/usr/bin/ust-consumerd
| make[2]: Nothing to be done for `install-data-am'.
| make[2]: Leaving directory `/disk0/pokybuild/build-multilib-x32-qemu/tmp/work/x86_64-x32-poky-linux-gnux32/lttng-ust-0.15-r2/ust-0.15/ust-consumerd'
| make[1]: Leaving directory `/disk0/pokybuild/build-multilib-x32-qemu/tmp/work/x86_64-x32-poky-linux-gnux32/lttng-ust-0.15-r2/ust-0.15/ust-consumerd'
| Making install in ustctl
| make[1]: Entering directory `/disk0/pokybuild/build-multilib-x32-qemu/tmp/work/x86_64-x32-poky-linux-gnux32/lttng-ust-0.15-r2/ust-0.15/ustctl'
| make[2]: Entering directory `/disk0/pokybuild/build-multilib-x32-qemu/tmp/work/x86_64-x32-poky-linux-gnux32/lttng-ust-0.15-r2/ust-0.15/ustctl'
| test -z "/usr/bin" || /bin/mkdir -p "/disk0/pokybuild/build-multilib-x32-qemu/tmp/work/x86_64-x32-poky-linux-gnux32/lttng-ust-0.15-r2/image/usr/bin"
|   /bin/sh ../x86_64-poky-linux-gnux32-libtool   --mode=install /usr/bin/install -c ustctl '/disk0/pokybuild/build-multilib-x32-qemu/tmp/work/x86_64-x32-poky-linux-gnux32/lttng-ust-0.15-r2/image/usr/bin'
| x86_64-poky-linux-gnux32-libtool: install: warning: `../libustctl/libustctl.la' has not been installed in `/usr/lib'
| x86_64-poky-linux-gnux32-libtool: install: /usr/bin/install -c .libs/ustctl /disk0/pokybuild/build-multilib-x32-qemu/tmp/work/x86_64-x32-poky-linux-gnux32/lttng-ust-0.15-r2/image/usr/bin/ustctl
| make[2]: Nothing to be done for `install-data-am'.
| make[2]: Leaving directory `/disk0/pokybuild/build-multilib-x32-qemu/tmp/work/x86_64-x32-poky-linux-gnux32/lttng-ust-0.15-r2/ust-0.15/ustctl'
| make[1]: Leaving directory `/disk0/pokybuild/build-multilib-x32-qemu/tmp/work/x86_64-x32-poky-linux-gnux32/lttng-ust-0.15-r2/ust-0.15/ustctl'
| Making install in libustfork
| make[1]: Entering directory `/disk0/pokybuild/build-multilib-x32-qemu/tmp/work/x86_64-x32-poky-linux-gnux32/lttng-ust-0.15-r2/ust-0.15/libustfork'
| make[2]: Entering directory `/disk0/pokybuild/build-multilib-x32-qemu/tmp/work/x86_64-x32-poky-linux-gnux32/lttng-ust-0.15-r2/ust-0.15/libustfork'
| test -z "/usr/lib" || /bin/mkdir -p "/disk0/pokybuild/build-multilib-x32-qemu/tmp/work/x86_64-x32-poky-linux-gnux32/lttng-ust-0.15-r2/image/usr/lib"
|  /bin/sh ../x86_64-poky-linux-gnux32-libtool   --mode=install /usr/bin/install -c   libustfork.la '/disk0/pokybuild/build-multilib-x32-qemu/tmp/work/x86_64-x32-poky-linux-gnux32/lttng-ust-0.15-r2/image/usr/lib'
| x86_64-poky-linux-gnux32-libtool: install: warning: relinking `libustfork.la'
| x86_64-poky-linux-gnux32-libtool: install: (cd /disk0/pokybuild/build-multilib-x32-qemu/tmp/work/x86_64-x32-poky-linux-gnux32/lttng-ust-0.15-r2/ust-0.15/libustfork; /bin/sh /disk0/pokybuild/build-multilib-x32-qemu/tmp/work/x86_64-x32-poky-linux-gnux32/lttng-ust-0.15-r2/ust-0.15/x86_64-poky-linux-gnux32-libtool  --tag CC --mode=relink ccache x86_64-poky-linux-gnux32-gcc -mx32 --sysroot=/disk0/pokybuild/build-multilib-x32-qemu/tmp/sysroots/qemux86-64 -fno-strict-aliasing -Wall -O2 -pipe -g -feliminate-unused-debug-types -Wl,-O1 -Wl,--hash-style=gnu -Wl,--as-needed -o libustfork.la -rpath /usr/lib ustfork.lo -ldl ../libust/libust.la -lurcu-bp -lurcu-bp -inst-prefix-dir /disk0/pokybuild/build-multilib-x32-qemu/tmp/work/x86_64-x32-poky-linux-gnux32/lttng-ust-0.15-r2/image)
| x86_64-poky-linux-gnux32-libtool: relink: warning: `/disk0/pokybuild/build-multilib-x32-qemu/tmp/sysroots/qemux86-64/usr/lib/liburcu-bp.la' seems to be moved
| x86_64-poky-linux-gnux32-libtool: relink: warning: `/disk0/pokybuild/build-multilib-x32-qemu/tmp/sysroots/qemux86-64/usr/lib/liburcu-cds.la' seems to be moved
| x86_64-poky-linux-gnux32-libtool: relink: warning: `/disk0/pokybuild/build-multilib-x32-qemu/tmp/sysroots/qemux86-64/usr/lib/liburcu-cds.la' seems to be moved
| x86_64-poky-linux-gnux32-libtool: relink: warning: `/disk0/pokybuild/build-multilib-x32-qemu/tmp/sysroots/qemux86-64/usr/lib/liburcu-cds.la' seems to be moved
| x86_64-poky-linux-gnux32-libtool: relink: ccache x86_64-poky-linux-gnux32-gcc   -mx32  --sysroot=/disk0/pokybuild/build-multilib-x32-qemu/tmp/sysroots/qemux86-64 -shared  -fPIC -DPIC  .libs/ustfork.o   -ldl -L/disk0/pokybuild/build-multilib-x32-qemu/tmp/work/x86_64-x32-poky-linux-gnux32/lttng-ust-0.15-r2/image/usr/lib -L/disk0/pokybuild/build-multilib-x32-qemu/tmp/sysroots/qemux86-64/usr/lib -lust -lrt -lurcu-bp -lurcu-cds -lpthread  -mx32 --sysroot=/disk0/pokybuild/build-multilib-x32-qemu/tmp/sysroots/qemux86-64 -O2 -Wl,-O1 -Wl,--hash-style=gnu -Wl,--as-needed   -Wl,-soname -Wl,libustfork.so.0 -o .libs/libustfork.so.0.0.0
| /disk0/pokybuild/build-multilib-x32-qemu/tmp/sysroots/x86_64-linux/usr/libexec/x86_64-x32-poky-linux-gnux32/gcc/x86_64-poky-linux-gnux32/4.7.0/ld: skipping incompatible /disk0/pokybuild/build-multilib-x32-qemu/tmp/work/x86_64-x32-poky-linux-gnux32/lttng-ust-0.15-r2/image/usr/lib/libust.so when searching for -lust
| /disk0/pokybuild/build-multilib-x32-qemu/tmp/sysroots/x86_64-linux/usr/libexec/x86_64-x32-poky-linux-gnux32/gcc/x86_64-poky-linux-gnux32/4.7.0/ld: /disk0/pokybuild/build-multilib-x32-qemu/tmp/work/x86_64-x32-poky-linux-gnux32/lttng-ust-0.15-r2/image/usr/lib/libust.a(libust_la-tracectl.o): relocation R_X86_64_32S against `.rodata' can not be used when making a shared object; recompile with -fPIC
| /disk0/pokybuild/build-multilib-x32-qemu/tmp/work/x86_64-x32-poky-linux-gnux32/lttng-ust-0.15-r2/image/usr/lib/libust.a: could not read symbols: Bad value
| collect2: error: ld returned 1 exit status
| x86_64-poky-linux-gnux32-libtool: install: error: relink `libustfork.la' with the above command before installing it
| make[2]: *** [install-libLTLIBRARIES] Error 1
| make[2]: Leaving directory `/disk0/pokybuild/build-multilib-x32-qemu/tmp/work/x86_64-x32-poky-linux-gnux32/lttng-ust-0.15-r2/ust-0.15/libustfork'
| make[1]: *** [install-am] Error 2
| make[1]: Leaving directory `/disk0/pokybuild/build-multilib-x32-qemu/tmp/work/x86_64-x32-poky-linux-gnux32/lttng-ust-0.15-r2/ust-0.15/libustfork'
| make: *** [install-recursive] Error 1
| ERROR: oe_runmake failed
| ERROR: Function 'do_install' failed (see /disk0/pokybuild/build-multilib-x32-qemu/tmp/work/x86_64-x32-poky-linux-gnux32/lttng-ust-0.15-r2/temp/log.do_install.7456 for further information)
NOTE: package lttng-ust-0.15-r2: task do_install: Failed
Comment 1 Nitin Kamble 2011-12-01 14:35:12 UTC
This issue does not exist with the latest meta-x32 layer.
Nitin