Bug 1415

Summary: x32: mesa-dri building fails
Product: [Build System, Metadata & Runtime] OE-Core Reporter: Nitin Kamble <nitin.a.kamble>
Component: coreAssignee: Nitin Kamble <nitin.a.kamble>
Status: RESOLVED WORKSFORME QA Contact:
Severity: normal    
Priority: Medium CC: hjl.tools, jiajun.xu, meta.mr.watcher, meta.watcher, wenhuax.fan
Version: unspecified   
Target Milestone: 1.2   
Hardware: x86   
OS: x86_64   
Whiteboard:
OS type for building Yocto: --- Type of Regression: ---
Verified: Documentation change: ---
Bug Depends on:    
Bug Blocks: 1579    

Description Nitin Kamble 2011-08-25 14:41:42 UTC
ERROR: Function 'do_compile' failed (see /disk0/pokybuild/build-multilib-x32-qemu/tmp/work/x86_64-x32-poky-linux-gnux32/mesa-dri-7.10.2-r1/temp/log.do_compile.6772 for further information)
ERROR: Logfile of failure stored in: /disk0/pokybuild/build-multilib-x32-qemu/tmp/work/x86_64-x32-poky-linux-gnux32/mesa-dri-7.10.2-r1/temp/log.do_compile.6772
Log data follows:
| DEBUG: SITE files ['endian-little', 'common-linux', 'common-glibc', 'bit-32', 'ix86-common', 'x86_64-linux-gnux32', 'common']
| NOTE: make -j 16
| make[1]: Entering directory `/disk0/pokybuild/build-multilib-x32-qemu/tmp/work/x86_64-x32-poky-linux-gnux32/mesa-dri-7.10.2-r1/Mesa-7.10.2/src'
| Making sources for autoconf
| make[2]: Entering directory `/disk0/pokybuild/build-multilib-x32-qemu/tmp/work/x86_64-x32-poky-linux-gnux32/mesa-dri-7.10.2-r1/Mesa-7.10.2/src/mapi/glapi'
| make[2]: Nothing to be done for `default'.
| make[2]: Leaving directory `/disk0/pokybuild/build-multilib-x32-qemu/tmp/work/x86_64-x32-poky-linux-gnux32/mesa-dri-7.10.2-r1/Mesa-7.10.2/src/mapi/glapi'
| make[2]: Entering directory `/disk0/pokybuild/build-multilib-x32-qemu/tmp/work/x86_64-x32-poky-linux-gnux32/mesa-dri-7.10.2-r1/Mesa-7.10.2/src/glsl'
| make[2]: Nothing to be done for `default'.
| make[2]: Leaving directory `/disk0/pokybuild/build-multilib-x32-qemu/tmp/work/x86_64-x32-poky-linux-gnux32/mesa-dri-7.10.2-r1/Mesa-7.10.2/src/glsl'
| make[2]: Entering directory `/disk0/pokybuild/build-multilib-x32-qemu/tmp/work/x86_64-x32-poky-linux-gnux32/mesa-dri-7.10.2-r1/Mesa-7.10.2/src/mesa'
| make[3]: Entering directory `/disk0/pokybuild/build-multilib-x32-qemu/tmp/work/x86_64-x32-poky-linux-gnux32/mesa-dri-7.10.2-r1/Mesa-7.10.2/src/mesa/drivers'
| make[4]: Entering directory `/disk0/pokybuild/build-multilib-x32-qemu/tmp/work/x86_64-x32-poky-linux-gnux32/mesa-dri-7.10.2-r1/Mesa-7.10.2/src/mesa/drivers/dri'
| make[5]: Entering directory `/disk0/pokybuild/build-multilib-x32-qemu/tmp/work/x86_64-x32-poky-linux-gnux32/mesa-dri-7.10.2-r1/Mesa-7.10.2/src/mesa/drivers/dri/i915'
| make[6]: Entering directory `/disk0/pokybuild/build-multilib-x32-qemu/tmp/work/x86_64-x32-poky-linux-gnux32/mesa-dri-7.10.2-r1/Mesa-7.10.2/src/mesa/drivers/dri/i915'
| /bin/sh ../../../../../bin/mklib -o i915_dri.so.tmp -noprefix -linker 'ccache x86_64-poky-linux-gnux32-g++   -mx32  --sysroot=/disk0/pokybuild/build-multilib-x32-qemu/tmp/sysroots/qemux86-64' -ldflags '-Wl,-O1 -Wl,--hash-style=gnu -Wl,--as-needed' \
| 	../common/utils.o ../common/vblank.o ../common/dri_util.o ../common/xmlconfig.o ../../common/driverfuncs.o ../common/texmem.o ../common/drirenderbuffer.o ../common/dri_metaops.o i830_context.o i830_state.o i830_texblend.o i830_texstate.o i830_vtbl.o intel_render.o intel_regions.o intel_buffer_objects.o intel_batchbuffer.o intel_clear.o intel_extensions.o intel_extensions_es2.o intel_mipmap_tree.o intel_tex_layout.o intel_tex_image.o intel_tex_subimage.o intel_tex_copy.o intel_tex_validate.o intel_tex_format.o intel_tex.o intel_pixel.o intel_pixel_bitmap.o intel_pixel_copy.o intel_pixel_draw.o intel_pixel_read.o intel_buffers.o intel_blit.o i915_tex_layout.o i915_texstate.o i915_context.o i915_debug.o i915_debug_fp.o i915_fragprog.o i915_program.o i915_state.o i915_vtbl.o intel_context.o intel_decode.o intel_screen.o intel_span.o intel_state.o intel_syncobj.o intel_tris.o intel_fbo.o    ../../../../../src/mesa/libmesa.a    -ldrm   -lexpat -lm -lpthread -ldl -ldrm_intel -ldrm
| mklib: Making Linux shared library:  i915_dri.so.tmp
| /disk0/pokybuild/build-multilib-x32-qemu/tmp/sysroots/x86_64-linux/usr/libexec/x86_64-x32-poky-linux-gnux32/gcc/x86_64-poky-linux-gnux32/4.7.0/ld: skipping incompatible /disk0/pokybuild/build-multilib-x32-qemu/tmp/sysroots/qemux86-64/usr/lib/../lib/libdrm.so when searching for -ldrm
| /disk0/pokybuild/build-multilib-x32-qemu/tmp/sysroots/x86_64-linux/usr/libexec/x86_64-x32-poky-linux-gnux32/gcc/x86_64-poky-linux-gnux32/4.7.0/ld: skipping incompatible /disk0/pokybuild/build-multilib-x32-qemu/tmp/sysroots/qemux86-64/usr/lib/libdrm.so when searching for -ldrm
| /disk0/pokybuild/build-multilib-x32-qemu/tmp/sysroots/x86_64-linux/usr/libexec/x86_64-x32-poky-linux-gnux32/gcc/x86_64-poky-linux-gnux32/4.7.0/ld: skipping incompatible /disk0/pokybuild/build-multilib-x32-qemu/tmp/sysroots/qemux86-64/usr/lib/libdrm.so when searching for -ldrm
| /disk0/pokybuild/build-multilib-x32-qemu/tmp/sysroots/x86_64-linux/usr/libexec/x86_64-x32-poky-linux-gnux32/gcc/x86_64-poky-linux-gnux32/4.7.0/ld: cannot find -ldrm
| /disk0/pokybuild/build-multilib-x32-qemu/tmp/sysroots/x86_64-linux/usr/libexec/x86_64-x32-poky-linux-gnux32/gcc/x86_64-poky-linux-gnux32/4.7.0/ld: skipping incompatible /disk0/pokybuild/build-multilib-x32-qemu/tmp/sysroots/qemux86-64/usr/lib/../lib/libexpat.so when searching for -lexpat
| /disk0/pokybuild/build-multilib-x32-qemu/tmp/sysroots/x86_64-linux/usr/libexec/x86_64-x32-poky-linux-gnux32/gcc/x86_64-poky-linux-gnux32/4.7.0/ld: skipping incompatible /disk0/pokybuild/build-multilib-x32-qemu/tmp/sysroots/qemux86-64/usr/lib/../lib/libexpat.a when searching for -lexpat
| /disk0/pokybuild/build-multilib-x32-qemu/tmp/sysroots/x86_64-linux/usr/libexec/x86_64-x32-poky-linux-gnux32/gcc/x86_64-poky-linux-gnux32/4.7.0/ld: skipping incompatible /disk0/pokybuild/build-multilib-x32-qemu/tmp/sysroots/qemux86-64/usr/lib/libexpat.so when searching for -lexpat
| /disk0/pokybuild/build-multilib-x32-qemu/tmp/sysroots/x86_64-linux/usr/libexec/x86_64-x32-poky-linux-gnux32/gcc/x86_64-poky-linux-gnux32/4.7.0/ld: skipping incompatible /disk0/pokybuild/build-multilib-x32-qemu/tmp/sysroots/qemux86-64/usr/lib/libexpat.a when searching for -lexpat
| /disk0/pokybuild/build-multilib-x32-qemu/tmp/sysroots/x86_64-linux/usr/libexec/x86_64-x32-poky-linux-gnux32/gcc/x86_64-poky-linux-gnux32/4.7.0/ld: skipping incompatible /disk0/pokybuild/build-multilib-x32-qemu/tmp/sysroots/qemux86-64/usr/lib/libexpat.so when searching for -lexpat
| /disk0/pokybuild/build-multilib-x32-qemu/tmp/sysroots/x86_64-linux/usr/libexec/x86_64-x32-poky-linux-gnux32/gcc/x86_64-poky-linux-gnux32/4.7.0/ld: skipping incompatible /disk0/pokybuild/build-multilib-x32-qemu/tmp/sysroots/qemux86-64/usr/lib/libexpat.a when searching for -lexpat
| /disk0/pokybuild/build-multilib-x32-qemu/tmp/sysroots/x86_64-linux/usr/libexec/x86_64-x32-poky-linux-gnux32/gcc/x86_64-poky-linux-gnux32/4.7.0/ld: cannot find -lexpat
| /disk0/pokybuild/build-multilib-x32-qemu/tmp/sysroots/x86_64-linux/usr/libexec/x86_64-x32-poky-linux-gnux32/gcc/x86_64-poky-linux-gnux32/4.7.0/ld: skipping incompatible /disk0/pokybuild/build-multilib-x32-qemu/tmp/sysroots/qemux86-64/usr/lib/../lib/libpthread.so when searching for -lpthread
| /disk0/pokybuild/build-multilib-x32-qemu/tmp/sysroots/x86_64-linux/usr/libexec/x86_64-x32-poky-linux-gnux32/gcc/x86_64-poky-linux-gnux32/4.7.0/ld: skipping incompatible /disk0/pokybuild/build-multilib-x32-qemu/tmp/sysroots/qemux86-64/usr/lib/../lib/libpthread.a when searching for -lpthread
| /disk0/pokybuild/build-multilib-x32-qemu/tmp/sysroots/x86_64-linux/usr/libexec/x86_64-x32-poky-linux-gnux32/gcc/x86_64-poky-linux-gnux32/4.7.0/ld: skipping incompatible /disk0/pokybuild/build-multilib-x32-qemu/tmp/sysroots/qemux86-64/usr/lib/libpthread.so when searching for -lpthread
| /disk0/pokybuild/build-multilib-x32-qemu/tmp/sysroots/x86_64-linux/usr/libexec/x86_64-x32-poky-linux-gnux32/gcc/x86_64-poky-linux-gnux32/4.7.0/ld: skipping incompatible /disk0/pokybuild/build-multilib-x32-qemu/tmp/sysroots/qemux86-64/usr/lib/libpthread.a when searching for -lpthread
| /disk0/pokybuild/build-multilib-x32-qemu/tmp/sysroots/x86_64-linux/usr/libexec/x86_64-x32-poky-linux-gnux32/gcc/x86_64-poky-linux-gnux32/4.7.0/ld: skipping incompatible /disk0/pokybuild/build-multilib-x32-qemu/tmp/sysroots/qemux86-64/usr/lib/libpthread.so when searching for -lpthread
| /disk0/pokybuild/build-multilib-x32-qemu/tmp/sysroots/x86_64-linux/usr/libexec/x86_64-x32-poky-linux-gnux32/gcc/x86_64-poky-linux-gnux32/4.7.0/ld: skipping incompatible /disk0/pokybuild/build-multilib-x32-qemu/tmp/sysroots/qemux86-64/usr/lib/libpthread.a when searching for -lpthread
| /disk0/pokybuild/build-multilib-x32-qemu/tmp/sysroots/x86_64-linux/usr/libexec/x86_64-x32-poky-linux-gnux32/gcc/x86_64-poky-linux-gnux32/4.7.0/ld: cannot find -lpthread
| /disk0/pokybuild/build-multilib-x32-qemu/tmp/sysroots/x86_64-linux/usr/libexec/x86_64-x32-poky-linux-gnux32/gcc/x86_64-poky-linux-gnux32/4.7.0/ld: skipping incompatible /disk0/pokybuild/build-multilib-x32-qemu/tmp/sysroots/qemux86-64/usr/lib/../lib/libdl.so when searching for -ldl
| /disk0/pokybuild/build-multilib-x32-qemu/tmp/sysroots/x86_64-linux/usr/libexec/x86_64-x32-poky-linux-gnux32/gcc/x86_64-poky-linux-gnux32/4.7.0/ld: skipping incompatible /disk0/pokybuild/build-multilib-x32-qemu/tmp/sysroots/qemux86-64/usr/lib/../lib/libdl.a when searching for -ldl
| /disk0/pokybuild/build-multilib-x32-qemu/tmp/sysroots/x86_64-linux/usr/libexec/x86_64-x32-poky-linux-gnux32/gcc/x86_64-poky-linux-gnux32/4.7.0/ld: skipping incompatible /disk0/pokybuild/build-multilib-x32-qemu/tmp/sysroots/qemux86-64/usr/lib/libdl.so when searching for -ldl
| /disk0/pokybuild/build-multilib-x32-qemu/tmp/sysroots/x86_64-linux/usr/libexec/x86_64-x32-poky-linux-gnux32/gcc/x86_64-poky-linux-gnux32/4.7.0/ld: skipping incompatible /disk0/pokybuild/build-multilib-x32-qemu/tmp/sysroots/qemux86-64/usr/lib/libdl.a when searching for -ldl
| /disk0/pokybuild/build-multilib-x32-qemu/tmp/sysroots/x86_64-linux/usr/libexec/x86_64-x32-poky-linux-gnux32/gcc/x86_64-poky-linux-gnux32/4.7.0/ld: skipping incompatible /disk0/pokybuild/build-multilib-x32-qemu/tmp/sysroots/qemux86-64/usr/lib/libdl.so when searching for -ldl
| /disk0/pokybuild/build-multilib-x32-qemu/tmp/sysroots/x86_64-linux/usr/libexec/x86_64-x32-poky-linux-gnux32/gcc/x86_64-poky-linux-gnux32/4.7.0/ld: skipping incompatible /disk0/pokybuild/build-multilib-x32-qemu/tmp/sysroots/qemux86-64/usr/lib/libdl.a when searching for -ldl
| /disk0/pokybuild/build-multilib-x32-qemu/tmp/sysroots/x86_64-linux/usr/libexec/x86_64-x32-poky-linux-gnux32/gcc/x86_64-poky-linux-gnux32/4.7.0/ld: cannot find -ldl
| /disk0/pokybuild/build-multilib-x32-qemu/tmp/sysroots/x86_64-linux/usr/libexec/x86_64-x32-poky-linux-gnux32/gcc/x86_64-poky-linux-gnux32/4.7.0/ld: skipping incompatible /disk0/pokybuild/build-multilib-x32-qemu/tmp/sysroots/qemux86-64/usr/lib/../lib/libdrm_intel.so when searching for -ldrm_intel
| /disk0/pokybuild/build-multilib-x32-qemu/tmp/sysroots/x86_64-linux/usr/libexec/x86_64-x32-poky-linux-gnux32/gcc/x86_64-poky-linux-gnux32/4.7.0/ld: skipping incompatible /disk0/pokybuild/build-multilib-x32-qemu/tmp/sysroots/qemux86-64/usr/lib/libdrm_intel.so when searching for -ldrm_intel
| /disk0/pokybuild/build-multilib-x32-qemu/tmp/sysroots/x86_64-linux/usr/libexec/x86_64-x32-poky-linux-gnux32/gcc/x86_64-poky-linux-gnux32/4.7.0/ld: skipping incompatible /disk0/pokybuild/build-multilib-x32-qemu/tmp/sysroots/qemux86-64/usr/lib/libdrm_intel.so when searching for -ldrm_intel
| /disk0/pokybuild/build-multilib-x32-qemu/tmp/sysroots/x86_64-linux/usr/libexec/x86_64-x32-poky-linux-gnux32/gcc/x86_64-poky-linux-gnux32/4.7.0/ld: cannot find -ldrm_intel
| /disk0/pokybuild/build-multilib-x32-qemu/tmp/sysroots/x86_64-linux/usr/libexec/x86_64-x32-poky-linux-gnux32/gcc/x86_64-poky-linux-gnux32/4.7.0/ld: skipping incompatible /disk0/pokybuild/build-multilib-x32-qemu/tmp/sysroots/qemux86-64/usr/lib/../lib/libdrm.so when searching for -ldrm
| /disk0/pokybuild/build-multilib-x32-qemu/tmp/sysroots/x86_64-linux/usr/libexec/x86_64-x32-poky-linux-gnux32/gcc/x86_64-poky-linux-gnux32/4.7.0/ld: skipping incompatible /disk0/pokybuild/build-multilib-x32-qemu/tmp/sysroots/qemux86-64/usr/lib/libdrm.so when searching for -ldrm
| /disk0/pokybuild/build-multilib-x32-qemu/tmp/sysroots/x86_64-linux/usr/libexec/x86_64-x32-poky-linux-gnux32/gcc/x86_64-poky-linux-gnux32/4.7.0/ld: skipping incompatible /disk0/pokybuild/build-multilib-x32-qemu/tmp/sysroots/qemux86-64/usr/lib/libdrm.so when searching for -ldrm
| /disk0/pokybuild/build-multilib-x32-qemu/tmp/sysroots/x86_64-linux/usr/libexec/x86_64-x32-poky-linux-gnux32/gcc/x86_64-poky-linux-gnux32/4.7.0/ld: cannot find -ldrm
| /disk0/pokybuild/build-multilib-x32-qemu/tmp/sysroots/x86_64-linux/usr/libexec/x86_64-x32-poky-linux-gnux32/gcc/x86_64-poky-linux-gnux32/4.7.0/ld: skipping incompatible /disk0/pokybuild/build-multilib-x32-qemu/tmp/sysroots/qemux86-64/usr/lib/../lib/libstdc++.so when searching for -lstdc++
| /disk0/pokybuild/build-multilib-x32-qemu/tmp/sysroots/x86_64-linux/usr/libexec/x86_64-x32-poky-linux-gnux32/gcc/x86_64-poky-linux-gnux32/4.7.0/ld: skipping incompatible /disk0/pokybuild/build-multilib-x32-qemu/tmp/sysroots/qemux86-64/usr/lib/../lib/libstdc++.a when searching for -lstdc++
| /disk0/pokybuild/build-multilib-x32-qemu/tmp/sysroots/x86_64-linux/usr/libexec/x86_64-x32-poky-linux-gnux32/gcc/x86_64-poky-linux-gnux32/4.7.0/ld: skipping incompatible /disk0/pokybuild/build-multilib-x32-qemu/tmp/sysroots/qemux86-64/usr/lib/libstdc++.so when searching for -lstdc++
| /disk0/pokybuild/build-multilib-x32-qemu/tmp/sysroots/x86_64-linux/usr/libexec/x86_64-x32-poky-linux-gnux32/gcc/x86_64-poky-linux-gnux32/4.7.0/ld: skipping incompatible /disk0/pokybuild/build-multilib-x32-qemu/tmp/sysroots/qemux86-64/usr/lib/libstdc++.a when searching for -lstdc++
| /disk0/pokybuild/build-multilib-x32-qemu/tmp/sysroots/x86_64-linux/usr/libexec/x86_64-x32-poky-linux-gnux32/gcc/x86_64-poky-linux-gnux32/4.7.0/ld: skipping incompatible /disk0/pokybuild/build-multilib-x32-qemu/tmp/sysroots/qemux86-64/usr/lib/libstdc++.so when searching for -lstdc++
| /disk0/pokybuild/build-multilib-x32-qemu/tmp/sysroots/x86_64-linux/usr/libexec/x86_64-x32-poky-linux-gnux32/gcc/x86_64-poky-linux-gnux32/4.7.0/ld: skipping incompatible /disk0/pokybuild/build-multilib-x32-qemu/tmp/sysroots/qemux86-64/usr/lib/libstdc++.a when searching for -lstdc++
| /disk0/pokybuild/build-multilib-x32-qemu/tmp/sysroots/x86_64-linux/usr/libexec/x86_64-x32-poky-linux-gnux32/gcc/x86_64-poky-linux-gnux32/4.7.0/ld: cannot find -lstdc++
| /disk0/pokybuild/build-multilib-x32-qemu/tmp/sysroots/x86_64-linux/usr/libexec/x86_64-x32-poky-linux-gnux32/gcc/x86_64-poky-linux-gnux32/4.7.0/ld: skipping incompatible /disk0/pokybuild/build-multilib-x32-qemu/tmp/sysroots/qemux86-64/usr/lib/../lib/libm.so when searching for -lm
| /disk0/pokybuild/build-multilib-x32-qemu/tmp/sysroots/x86_64-linux/usr/libexec/x86_64-x32-poky-linux-gnux32/gcc/x86_64-poky-linux-gnux32/4.7.0/ld: skipping incompatible /disk0/pokybuild/build-multilib-x32-qemu/tmp/sysroots/qemux86-64/usr/lib/../lib/libm.a when searching for -lm
| /disk0/pokybuild/build-multilib-x32-qemu/tmp/sysroots/x86_64-linux/usr/libexec/x86_64-x32-poky-linux-gnux32/gcc/x86_64-poky-linux-gnux32/4.7.0/ld: skipping incompatible /disk0/pokybuild/build-multilib-x32-qemu/tmp/sysroots/qemux86-64/usr/lib/libm.so when searching for -lm
| /disk0/pokybuild/build-multilib-x32-qemu/tmp/sysroots/x86_64-linux/usr/libexec/x86_64-x32-poky-linux-gnux32/gcc/x86_64-poky-linux-gnux32/4.7.0/ld: skipping incompatible /disk0/pokybuild/build-multilib-x32-qemu/tmp/sysroots/qemux86-64/usr/lib/libm.a when searching for -lm
| /disk0/pokybuild/build-multilib-x32-qemu/tmp/sysroots/x86_64-linux/usr/libexec/x86_64-x32-poky-linux-gnux32/gcc/x86_64-poky-linux-gnux32/4.7.0/ld: skipping incompatible /disk0/pokybuild/build-multilib-x32-qemu/tmp/sysroots/qemux86-64/usr/lib/libm.so when searching for -lm
| /disk0/pokybuild/build-multilib-x32-qemu/tmp/sysroots/x86_64-linux/usr/libexec/x86_64-x32-poky-linux-gnux32/gcc/x86_64-poky-linux-gnux32/4.7.0/ld: skipping incompatible /disk0/pokybuild/build-multilib-x32-qemu/tmp/sysroots/qemux86-64/usr/lib/libm.a when searching for -lm
| /disk0/pokybuild/build-multilib-x32-qemu/tmp/sysroots/x86_64-linux/usr/libexec/x86_64-x32-poky-linux-gnux32/gcc/x86_64-poky-linux-gnux32/4.7.0/ld: cannot find -lm
| /disk0/pokybuild/build-multilib-x32-qemu/tmp/sysroots/x86_64-linux/usr/libexec/x86_64-x32-poky-linux-gnux32/gcc/x86_64-poky-linux-gnux32/4.7.0/ld: skipping incompatible /disk0/pokybuild/build-multilib-x32-qemu/tmp/sysroots/qemux86-64/lib/../lib/libgcc_s.so when searching for -lgcc_s
| /disk0/pokybuild/build-multilib-x32-qemu/tmp/sysroots/x86_64-linux/usr/libexec/x86_64-x32-poky-linux-gnux32/gcc/x86_64-poky-linux-gnux32/4.7.0/ld: skipping incompatible /disk0/pokybuild/build-multilib-x32-qemu/tmp/sysroots/qemux86-64/lib/libgcc_s.so when searching for -lgcc_s
| /disk0/pokybuild/build-multilib-x32-qemu/tmp/sysroots/x86_64-linux/usr/libexec/x86_64-x32-poky-linux-gnux32/gcc/x86_64-poky-linux-gnux32/4.7.0/ld: skipping incompatible /disk0/pokybuild/build-multilib-x32-qemu/tmp/sysroots/qemux86-64/lib/libgcc_s.so when searching for -lgcc_s
| /disk0/pokybuild/build-multilib-x32-qemu/tmp/sysroots/x86_64-linux/usr/libexec/x86_64-x32-poky-linux-gnux32/gcc/x86_64-poky-linux-gnux32/4.7.0/ld: cannot find -lgcc_s
| /disk0/pokybuild/build-multilib-x32-qemu/tmp/sysroots/x86_64-linux/usr/libexec/x86_64-x32-poky-linux-gnux32/gcc/x86_64-poky-linux-gnux32/4.7.0/ld: skipping incompatible /disk0/pokybuild/build-multilib-x32-qemu/tmp/sysroots/qemux86-64/usr/lib/../lib/libc.so when searching for -lc
| /disk0/pokybuild/build-multilib-x32-qemu/tmp/sysroots/x86_64-linux/usr/libexec/x86_64-x32-poky-linux-gnux32/gcc/x86_64-poky-linux-gnux32/4.7.0/ld: skipping incompatible /disk0/pokybuild/build-multilib-x32-qemu/tmp/sysroots/qemux86-64/usr/lib/../lib/libc.a when searching for -lc
| /disk0/pokybuild/build-multilib-x32-qemu/tmp/sysroots/x86_64-linux/usr/libexec/x86_64-x32-poky-linux-gnux32/gcc/x86_64-poky-linux-gnux32/4.7.0/ld: skipping incompatible /disk0/pokybuild/build-multilib-x32-qemu/tmp/sysroots/qemux86-64/usr/lib/libc.so when searching for -lc
| /disk0/pokybuild/build-multilib-x32-qemu/tmp/sysroots/x86_64-linux/usr/libexec/x86_64-x32-poky-linux-gnux32/gcc/x86_64-poky-linux-gnux32/4.7.0/ld: skipping incompatible /disk0/pokybuild/build-multilib-x32-qemu/tmp/sysroots/qemux86-64/usr/lib/libc.a when searching for -lc
| /disk0/pokybuild/build-multilib-x32-qemu/tmp/sysroots/x86_64-linux/usr/libexec/x86_64-x32-poky-linux-gnux32/gcc/x86_64-poky-linux-gnux32/4.7.0/ld: skipping incompatible /disk0/pokybuild/build-multilib-x32-qemu/tmp/sysroots/qemux86-64/usr/lib/libc.so when searching for -lc
| /disk0/pokybuild/build-multilib-x32-qemu/tmp/sysroots/x86_64-linux/usr/libexec/x86_64-x32-poky-linux-gnux32/gcc/x86_64-poky-linux-gnux32/4.7.0/ld: skipping incompatible /disk0/pokybuild/build-multilib-x32-qemu/tmp/sysroots/qemux86-64/usr/lib/libc.a when searching for -lc
| /disk0/pokybuild/build-multilib-x32-qemu/tmp/sysroots/x86_64-linux/usr/libexec/x86_64-x32-poky-linux-gnux32/gcc/x86_64-poky-linux-gnux32/4.7.0/ld: cannot find -lc
| /disk0/pokybuild/build-multilib-x32-qemu/tmp/sysroots/x86_64-linux/usr/libexec/x86_64-x32-poky-linux-gnux32/gcc/x86_64-poky-linux-gnux32/4.7.0/ld: skipping incompatible /disk0/pokybuild/build-multilib-x32-qemu/tmp/sysroots/qemux86-64/lib/../lib/libgcc_s.so when searching for -lgcc_s
| /disk0/pokybuild/build-multilib-x32-qemu/tmp/sysroots/x86_64-linux/usr/libexec/x86_64-x32-poky-linux-gnux32/gcc/x86_64-poky-linux-gnux32/4.7.0/ld: skipping incompatible /disk0/pokybuild/build-multilib-x32-qemu/tmp/sysroots/qemux86-64/lib/libgcc_s.so when searching for -lgcc_s
| /disk0/pokybuild/build-multilib-x32-qemu/tmp/sysroots/x86_64-linux/usr/libexec/x86_64-x32-poky-linux-gnux32/gcc/x86_64-poky-linux-gnux32/4.7.0/ld: skipping incompatible /disk0/pokybuild/build-multilib-x32-qemu/tmp/sysroots/qemux86-64/lib/libgcc_s.so when searching for -lgcc_s
| /disk0/pokybuild/build-multilib-x32-qemu/tmp/sysroots/x86_64-linux/usr/libexec/x86_64-x32-poky-linux-gnux32/gcc/x86_64-poky-linux-gnux32/4.7.0/ld: cannot find -lgcc_s
| collect2: error: ld returned 1 exit status
| ccache x86_64-poky-linux-gnux32-g++   -mx32  --sysroot=/disk0/pokybuild/build-multilib-x32-qemu/tmp/sysroots/qemux86-64 -O2 -pipe -g -feliminate-unused-debug-types -Wall -Wmissing-prototypes -std=c99 -ffast-math -fvisibility=hidden -fno-strict-aliasing  -fPIC   -D_GNU_SOURCE -DPTHREADS -DHAVE_POSIX_MEMALIGN -DGLX_USE_TLS -DPTHREADS -DUSE_EXTERNAL_DXTN_LIB=1 -DIN_DRI_DRIVER -DGLX_DIRECT_RENDERING -DGLX_INDIRECT_RENDERING -DHAVE_ALIAS -DFEATURE_GL=1 -o i915_dri.so.test ../../../../../src/mesa/drivers/dri/common/dri_test.o i915_dri.so.tmp   -ldrm   -lexpat -lm -lpthread -ldl -ldrm_intel -ldrm
| x86_64-poky-linux-gnux32-g++: error: i915_dri.so.tmp: No such file or directory
| make[6]: *** [i915_dri.so] Error 1
| make[6]: Leaving directory `/disk0/pokybuild/build-multilib-x32-qemu/tmp/work/x86_64-x32-poky-linux-gnux32/mesa-dri-7.10.2-r1/Mesa-7.10.2/src/mesa/drivers/dri/i915'
| make[5]: *** [lib] Error 2
| make[5]: Leaving directory `/disk0/pokybuild/build-multilib-x32-qemu/tmp/work/x86_64-x32-poky-linux-gnux32/mesa-dri-7.10.2-r1/Mesa-7.10.2/src/mesa/drivers/dri/i915'
| make[4]: *** [subdirs] Error 1
| make[4]: Leaving directory `/disk0/pokybuild/build-multilib-x32-qemu/tmp/work/x86_64-x32-poky-linux-gnux32/mesa-dri-7.10.2-r1/Mesa-7.10.2/src/mesa/drivers/dri'
| make[3]: *** [default] Error 1
| make[3]: Leaving directory `/disk0/pokybuild/build-multilib-x32-qemu/tmp/work/x86_64-x32-poky-linux-gnux32/mesa-dri-7.10.2-r1/Mesa-7.10.2/src/mesa/drivers'
| make[2]: *** [driver_subdirs] Error 2
| make[2]: Leaving directory `/disk0/pokybuild/build-multilib-x32-qemu/tmp/work/x86_64-x32-poky-linux-gnux32/mesa-dri-7.10.2-r1/Mesa-7.10.2/src/mesa'
| make[1]: *** [subdirs] Error 1
| make[1]: Leaving directory `/disk0/pokybuild/build-multilib-x32-qemu/tmp/work/x86_64-x32-poky-linux-gnux32/mesa-dri-7.10.2-r1/Mesa-7.10.2/src'
| make: *** [default] Error 1
| ERROR: oe_runmake failed
| ERROR: Function 'do_compile' failed (see /disk0/pokybuild/build-multilib-x32-qemu/tmp/work/x86_64-x32-poky-linux-gnux32/mesa-dri-7.10.2-r1/temp/log.do_compile.6772 for further information)
Comment 1 wenhua.fan 2011-09-07 02:50:32 UTC
This issue appear also in 20110907 build on autobuilder.

Commit information:

Tree/Branch: Poky/Master
Commit id: 45416a04123a46ce0a35c6b9286bf53f2f8ce257
Meta branch: Master
Commit id: dbff56238e083d0110eb13c1f5a07716340fdfe4

Detail information please refer to http://autobuilder.yoctoproject.org:8010/builders/nightly-x86/builds/76/steps/shell_55/logs/stdio
Comment 2 Jiajun Xu 2011-09-07 08:33:12 UTC
(In reply to comment #1)
> This issue appear also in 20110907 build on autobuilder.
> Commit information:
> Tree/Branch: Poky/Master
> Commit id: 45416a04123a46ce0a35c6b9286bf53f2f8ce257
> Meta branch: Master
> Commit id: dbff56238e083d0110eb13c1f5a07716340fdfe4
> Detail information please refer to
> http://autobuilder.yoctoproject.org:8010/builders/nightly-x86/builds/76/steps/shell_55/logs/stdio

Totally different error message on current autobuilder, pls. ignore Wenhua's comments above.
Comment 3 Nitin Kamble 2011-12-01 14:59:37 UTC
this issue does not happen on the latest meta-x32 layer.
Nitin