Bug 1416

Summary: x32: hal building fails
Product: [Build System, Metadata & Runtime] OE-Core Reporter: Nitin Kamble <nitin.a.kamble>
Component: coreAssignee: Nitin Kamble <nitin.a.kamble>
Status: RESOLVED INVALID QA Contact:
Severity: normal    
Priority: Medium CC: hjl.tools, meta.mr.watcher, meta.watcher
Version: unspecified   
Target Milestone: 1.2   
Hardware: x86   
OS: x86_64   
Whiteboard:
OS type for building Yocto: --- Type of Regression: ---
Verified: Documentation change: ---
Bug Depends on:    
Bug Blocks: 1579    

Description Nitin Kamble 2011-08-25 14:43:02 UTC
ERROR: Function 'do_compile' failed (see /disk0/pokybuild/build-multilib-x32-qemu/tmp/work/x86_64-x32-poky-linux-gnux32/hal-0.5.14-r4/temp/log.do_compile.6862 for further information)
ERROR: Logfile of failure stored in: /disk0/pokybuild/build-multilib-x32-qemu/tmp/work/x86_64-x32-poky-linux-gnux32/hal-0.5.14-r4/temp/log.do_compile.6862
Log data follows:
| DEBUG: SITE files ['endian-little', 'common-linux', 'common-glibc', 'bit-32', 'ix86-common', 'x86_64-linux-gnux32', 'common']
| NOTE: make -j 16 -e udevrulesdir=$(sysconfdir)/udev/rules.d
| make  all-recursive
| make[1]: Entering directory `/disk0/pokybuild/build-multilib-x32-qemu/tmp/work/x86_64-x32-poky-linux-gnux32/hal-0.5.14-r4/hal-0.5.14'
| Making all in libhal
| make[2]: Entering directory `/disk0/pokybuild/build-multilib-x32-qemu/tmp/work/x86_64-x32-poky-linux-gnux32/hal-0.5.14-r4/hal-0.5.14/libhal'
| make[2]: Nothing to be done for `all'.
| make[2]: Leaving directory `/disk0/pokybuild/build-multilib-x32-qemu/tmp/work/x86_64-x32-poky-linux-gnux32/hal-0.5.14-r4/hal-0.5.14/libhal'
| Making all in libhal-storage
| make[2]: Entering directory `/disk0/pokybuild/build-multilib-x32-qemu/tmp/work/x86_64-x32-poky-linux-gnux32/hal-0.5.14-r4/hal-0.5.14/libhal-storage'
| make[2]: Nothing to be done for `all'.
| make[2]: Leaving directory `/disk0/pokybuild/build-multilib-x32-qemu/tmp/work/x86_64-x32-poky-linux-gnux32/hal-0.5.14-r4/hal-0.5.14/libhal-storage'
| Making all in partutil
| make[2]: Entering directory `/disk0/pokybuild/build-multilib-x32-qemu/tmp/work/x86_64-x32-poky-linux-gnux32/hal-0.5.14-r4/hal-0.5.14/partutil'
| make[2]: Nothing to be done for `all'.
| make[2]: Leaving directory `/disk0/pokybuild/build-multilib-x32-qemu/tmp/work/x86_64-x32-poky-linux-gnux32/hal-0.5.14-r4/hal-0.5.14/partutil'
| Making all in hald
| make[2]: Entering directory `/disk0/pokybuild/build-multilib-x32-qemu/tmp/work/x86_64-x32-poky-linux-gnux32/hal-0.5.14-r4/hal-0.5.14/hald'
| make  all-recursive
| make[3]: Entering directory `/disk0/pokybuild/build-multilib-x32-qemu/tmp/work/x86_64-x32-poky-linux-gnux32/hal-0.5.14-r4/hal-0.5.14/hald'
| Making all in dummy
| make[4]: Entering directory `/disk0/pokybuild/build-multilib-x32-qemu/tmp/work/x86_64-x32-poky-linux-gnux32/hal-0.5.14-r4/hal-0.5.14/hald/dummy'
| make[4]: Nothing to be done for `all'.
| make[4]: Leaving directory `/disk0/pokybuild/build-multilib-x32-qemu/tmp/work/x86_64-x32-poky-linux-gnux32/hal-0.5.14-r4/hal-0.5.14/hald/dummy'
| Making all in freebsd
| make[4]: Entering directory `/disk0/pokybuild/build-multilib-x32-qemu/tmp/work/x86_64-x32-poky-linux-gnux32/hal-0.5.14-r4/hal-0.5.14/hald/freebsd'
| Making all in libprobe
| make[5]: Entering directory `/disk0/pokybuild/build-multilib-x32-qemu/tmp/work/x86_64-x32-poky-linux-gnux32/hal-0.5.14-r4/hal-0.5.14/hald/freebsd/libprobe'
| make[5]: Nothing to be done for `all'.
| make[5]: Leaving directory `/disk0/pokybuild/build-multilib-x32-qemu/tmp/work/x86_64-x32-poky-linux-gnux32/hal-0.5.14-r4/hal-0.5.14/hald/freebsd/libprobe'
| Making all in probing
| make[5]: Entering directory `/disk0/pokybuild/build-multilib-x32-qemu/tmp/work/x86_64-x32-poky-linux-gnux32/hal-0.5.14-r4/hal-0.5.14/hald/freebsd/probing'
| make[5]: Nothing to be done for `all'.
| make[5]: Leaving directory `/disk0/pokybuild/build-multilib-x32-qemu/tmp/work/x86_64-x32-poky-linux-gnux32/hal-0.5.14-r4/hal-0.5.14/hald/freebsd/probing'
| Making all in addons
| make[5]: Entering directory `/disk0/pokybuild/build-multilib-x32-qemu/tmp/work/x86_64-x32-poky-linux-gnux32/hal-0.5.14-r4/hal-0.5.14/hald/freebsd/addons'
| make[5]: Nothing to be done for `all'.
| make[5]: Leaving directory `/disk0/pokybuild/build-multilib-x32-qemu/tmp/work/x86_64-x32-poky-linux-gnux32/hal-0.5.14-r4/hal-0.5.14/hald/freebsd/addons'
| Making all in .
| make[5]: Entering directory `/disk0/pokybuild/build-multilib-x32-qemu/tmp/work/x86_64-x32-poky-linux-gnux32/hal-0.5.14-r4/hal-0.5.14/hald/freebsd'
| make[5]: Nothing to be done for `all-am'.
| make[5]: Leaving directory `/disk0/pokybuild/build-multilib-x32-qemu/tmp/work/x86_64-x32-poky-linux-gnux32/hal-0.5.14-r4/hal-0.5.14/hald/freebsd'
| make[4]: Leaving directory `/disk0/pokybuild/build-multilib-x32-qemu/tmp/work/x86_64-x32-poky-linux-gnux32/hal-0.5.14-r4/hal-0.5.14/hald/freebsd'
| Making all in linux
| make[4]: Entering directory `/disk0/pokybuild/build-multilib-x32-qemu/tmp/work/x86_64-x32-poky-linux-gnux32/hal-0.5.14-r4/hal-0.5.14/hald/linux'
| Making all in probing
| make[5]: Entering directory `/disk0/pokybuild/build-multilib-x32-qemu/tmp/work/x86_64-x32-poky-linux-gnux32/hal-0.5.14-r4/hal-0.5.14/hald/linux/probing'
| ccache x86_64-poky-linux-gnux32-gcc   -mx32  --sysroot=/disk0/pokybuild/build-multilib-x32-qemu/tmp/sysroots/qemux86-64 -DHAVE_CONFIG_H -I. -I../../..  -DPACKAGE_SYSCONF_DIR=\""/etc"\" -DPACKAGE_DATA_DIR=\""/usr/share"\" -DPACKAGE_BIN_DIR=\""/usr/bin"\" -DPACKAGE_LOCALE_DIR=\""/usr/share/locale"\" -DPACKAGE_LOCALSTATEDIR=\""/var"\" -I../../.. -pthread -I/disk0/pokybuild/build-multilib-x32-qemu/tmp/sysroots/qemux86-64/usr/include/glib-2.0 -I/disk0/pokybuild/build-multilib-x32-qemu/tmp/sysroots/qemux86-64/usr/lib/glib-2.0/include -I/disk0/pokybuild/build-multilib-x32-qemu/tmp/sysroots/qemux86-64/usr/include/dbus-1.0 -I/disk0/pokybuild/build-multilib-x32-qemu/tmp/sysroots/qemux86-64/usr/lib/dbus-1.0/include   -I/disk0/pokybuild/build-multilib-x32-qemu/tmp/sysroots/qemux86-64/usr/include/dbus-1.0 -I/disk0/pokybuild/build-multilib-x32-qemu/tmp/sysroots/qemux86-64/usr/lib/dbus-1.0/include   -I/disk0/pokybuild/build-multilib-x32-qemu/tmp/sysroots/qemux86-64/usr/include/blkid -I/disk0/pokybuild/build-multilib-x32-qemu/tmp/sysroots/qemux86-64/usr/include/uuid     -O2 -pipe -g -feliminate-unused-debug-types -MT probe-video4linux.o -MD -MP -MF .deps/probe-video4linux.Tpo -c -o probe-video4linux.o probe-video4linux.c
| probe-video4linux.c:33:28: fatal error: linux/videodev.h: No such file or directory
| compilation terminated.
| make[5]: *** [probe-video4linux.o] Error 1
| make[5]: Leaving directory `/disk0/pokybuild/build-multilib-x32-qemu/tmp/work/x86_64-x32-poky-linux-gnux32/hal-0.5.14-r4/hal-0.5.14/hald/linux/probing'
| make[4]: *** [all-recursive] Error 1
| make[4]: Leaving directory `/disk0/pokybuild/build-multilib-x32-qemu/tmp/work/x86_64-x32-poky-linux-gnux32/hal-0.5.14-r4/hal-0.5.14/hald/linux'
| make[3]: *** [all-recursive] Error 1
| make[3]: Leaving directory `/disk0/pokybuild/build-multilib-x32-qemu/tmp/work/x86_64-x32-poky-linux-gnux32/hal-0.5.14-r4/hal-0.5.14/hald'
| make[2]: *** [all] Error 2
| make[2]: Leaving directory `/disk0/pokybuild/build-multilib-x32-qemu/tmp/work/x86_64-x32-poky-linux-gnux32/hal-0.5.14-r4/hal-0.5.14/hald'
| make[1]: *** [all-recursive] Error 1
| make[1]: Leaving directory `/disk0/pokybuild/build-multilib-x32-qemu/tmp/work/x86_64-x32-poky-linux-gnux32/hal-0.5.14-r4/hal-0.5.14'
| make: *** [all] Error 2
| ERROR: oe_runmake failed
| ERROR: Function 'do_compile' failed (see /disk0/pokybuild/build-multilib-x32-qemu/tmp/work/x86_64-x32-poky-linux-gnux32/hal-0.5.14-r4/temp/log.do_compile.6862 for further information)
NOTE: package hal-0.5.14-r4: task do_compile: Failed
Comment 1 Nitin Kamble 2011-12-01 15:01:14 UTC
As hal recipe is removed from the poky layer, closing this bug as invalid.