| Summary: | AB-INT PTEST: strace ptest intermittent failure in qual_fault-syscall.test | ||
|---|---|---|---|
| Product: | [QA/Testing] Package Testing (ptest) | Reporter: | Naveen Saini <naveen.kumar.saini> |
| Component: | ptest | Assignee: | Randy MacLeod <randy.macleod> |
| Status: | RESOLVED WORKSFORME | QA Contact: | |
| Severity: | normal | ||
| Priority: | Medium | CC: | alexandre.belloni, chee.yang.lee, joaomarcos.costa, jon.mason, randy.macleod, ross.burton |
| Version: | 3.3 | ||
| Target Milestone: | 5.2 | ||
| Hardware: | x86 | ||
| OS: | arm64 | ||
| Whiteboard: | AB-INT | ||
| OS type for building Yocto: | --- | Type of Regression: | --- |
| Verified: | Documentation change: | No (bug/feature does not impact docs) | |
|
Description
Naveen Saini
2020-12-28 07:44:35 UTC
Observed same ptest failure with qemux86-64 too (master-next)
AssertionError: Failed ptests:
{'strace': ['qual_fault-syscall.test', 'qual_fault.test']}
https://autobuilder.yoctoproject.org/typhoon/#/builders/81/builds/1647
i think these should be same issue
Worker: ubuntu2004-arm-1
master
WARNING: core-image-sato-sdk-ptest-1.0-r0 do_testimage: There were failing ptests.
Traceback (most recent call last):
File "/home/pokybuild/yocto-worker/qemuarm64-ptest/build/meta/lib/oeqa/core/decorator/__init__.py", line 36, in wrapped_f
return func(*args, **kwargs)
File "/home/pokybuild/yocto-worker/qemuarm64-ptest/build/meta/lib/oeqa/core/decorator/__init__.py", line 36, in wrapped_f
return func(*args, **kwargs)
File "/home/pokybuild/yocto-worker/qemuarm64-ptest/build/meta/lib/oeqa/core/decorator/__init__.py", line 36, in wrapped_f
return func(*args, **kwargs)
File "/home/pokybuild/yocto-worker/qemuarm64-ptest/build/meta/lib/oeqa/runtime/cases/ptest.py", line 25, in test_ptestrunner_expectfail
self.do_ptestrunner()
File "/home/pokybuild/yocto-worker/qemuarm64-ptest/build/meta/lib/oeqa/runtime/cases/ptest.py", line 112, in do_ptestrunner
self.fail(failmsg)
AssertionError: Failed ptests:
{'strace': ['qual_fault.test']}
https://autobuilder.yoctoproject.org/typhoon/#/builders/82/builds/1439/steps/12/logs/stdio
tried to reproduce on qemux86-64: tests/qual_fault.log:qual_fault.test: failed test: time limit (120) exceeded Attempted to raise the timeout limit to 1200s and test passed. same for qual_fault_syscall 1200 s is a bit long. How about 2x the actual time required? 2x was implemented so 240s (4min) for timeout Please add a link to the commit so that people can see the change for themselves. *** Bug 14197 has been marked as a duplicate of this bug. *** *** Bug 14198 has been marked as a duplicate of this bug. *** happened again https://autobuilder.yoctoproject.org/typhoon/#/builders/81/builds/2079/steps/12/logs/stdio qemux86-64-ptest fedora33-ty-1 https://autobuilder.yoctoproject.org/typhoon/#/builders/81/builds/2214/steps/12/logs/stdio qemux86-64-ptest fedora33-ty-1 https://autobuilder.yoctoproject.org/typhoon/#/builders/82/builds/2061/steps/12/logs/stdio qemuarm64-ptest ubuntu2004-arm-1 https://autobuilder.yoctoproject.org/typhoon/#/builders/82/builds/2147/steps/12/logs/stdio qemuarm64-ptest ubuntu2004-arm-1 https://autobuilder.yoctoproject.org/typhoon/#/builders/82/builds/2172/steps/12/logs/stdio qemuarm64-ptest ubuntu2004-arm-1 https://autobuilder.yoctoproject.org/typhoon/#/builders/81/builds/2555/steps/12/logs/stdio qemux86-64-ptest debian10-ty-3 Not seen in months and strace tests are run frequently. https://autobuilder.yoctoproject.org/typhoon/#/builders/82/builds/4205/steps/12/logs/stdio qemuarm64-ptest ubuntu2004-arm-1 'strace': ['trace_statfs.gen.test', 'qual_fault-syscall.test', 'trace_statfs.gen', 'qual_fault-syscall'], Need to update to strace-6.1 as well. https://autobuilder.yoctoproject.org/typhoon/#/builders/82/builds/4343/steps/12/logs/stdio qemuarm64-ptest ubuntu2004-arm-1 https://autobuilder.yoctoproject.org/typhoon/#/builders/82/builds/4653/steps/12/logs/stdio qemuarm64-ptest ubuntu2004-arm-1 https://autobuilder.yoctoproject.org/typhoon/#/builders/82/builds/5562/steps/13/logs/stdio qemuarm64-ptest ubuntu1804-arm-1 https://autobuilder.yoctoproject.org/typhoon/#/builders/82/builds/6087/steps/12/logs/stdio Failed ptests: {'strace': ['qual_fault-syscall.test', 'qual_fault.test', 'qual_fault-syscall', 'qual_fault']} qemuarm64-ptest ubuntu2004-arm-1 https://autobuilder.yoctoproject.org/typhoon/#/builders/82/builds/6261/steps/13/logs/stdio Failed ptests: {'strace': ['qual_fault-syscall.test', 'qual_fault.test', 'qual_fault-syscall', 'qual_fault']} qemuarm64-ptest ubuntu1804-arm-1 https://autobuilder.yoctoproject.org/typhoon/#/builders/82/builds/6544/steps/12/logs/stdio AssertionError: Failed ptests: {'strace': ['filtering_syscall-syntax.test', 'qual_fault-syscall.test', 'filtering_syscall-syntax', 'qual_fault-syscall']} qemuarm64-ptest ubuntu2204-arm-1 https://autobuilder.yoctoproject.org/typhoon/#/builders/82/builds/6567/steps/12/logs/stdio qemuarm64-ptest ubuntu2004-arm-1 https://autobuilder.yoctoproject.org/typhoon/#/builders/82/builds/6688/steps/12/logs/stdio qemuarm64-ptest ubuntu2004-arm-1 Not seen recently or on the new AB cluster. |