Bug 14600

Summary: libnewt is not reproductible
Product: [Build System, Metadata & Runtime] OE-Core Reporter: Thomas Perrot <thomas.perrot>
Component: coreAssignee: Unassigned <unassigned>
Status: RESOLVED FIXED QA Contact:
Severity: normal    
Priority: Undecided CC: meta.mr.watcher, meta.watcher, richard.purdie
Version: unspecified   
Target Milestone: ---   
Hardware: x86   
OS: Multiple   
Whiteboard:
OS type for building Yocto: --- Type of Regression: ---
Verified: Documentation change: No (bug/feature does not impact docs)

Description Thomas Perrot 2021-10-13 09:26:56 UTC
https://autobuilder.yoctoproject.org/typhoon/#/builders/117/builds/254/steps/12/logs/stdio

2021-10-12 00:04:15,440 - oe-selftest - INFO - ======================================================================
2021-10-12 00:04:15,440 - oe-selftest - INFO - FAIL: test_reproducible_builds (reproducible.ReproducibleTests)
2021-10-12 00:04:15,440 - oe-selftest - INFO - ----------------------------------------------------------------------
2021-10-12 00:04:15,440 - oe-selftest - INFO - Traceback (most recent call last):
  File "/home/pokybuild/yocto-worker/reproducible/build/meta/lib/oeqa/selftest/cases/reproducible.py", line 332, in test_reproducible_builds
    self.fail('\n'.join(fails))
AssertionError: The following deb packages are missing or different and not in exclusion list: /home/pokybuild/yocto-worker/reproducible/build/build-st/reproducibleB/tmp/deploy/deb/./core2-64/libnewt-dbg_0.52.21-r0_amd64.deb
/home/pokybuild/yocto-worker/reproducible/build/build-st/reproducibleB/tmp/deploy/deb/./core2-64/libnewt-python_0.52.21-r0_amd64.deb
/home/pokybuild/yocto-worker/reproducible/build/build-st/reproducibleB/tmp/deploy/deb/./core2-64/libxml2-dbg_2.9.12-r0_amd64.deb
/home/pokybuild/yocto-worker/reproducible/build/build-st/reproducibleB/tmp/deploy/deb/./core2-64/libxml2-ptest_2.9.12-r0_amd64.deb
/home/pokybuild/yocto-worker/reproducible/build/build-st/reproducibleB/tmp/deploy/deb/./core2-64/libxml2-python_2.9.12-r0_amd64.deb
The following ipk packages are missing or different and not in exclusion list: /home/pokybuild/yocto-worker/reproducible/build/build-st/reproducibleB/tmp/deploy/ipk/./core2-64/libnewt-dbg_0.52.21-r0_core2-64.ipk
/home/pokybuild/yocto-worker/reproducible/build/build-st/reproducibleB/tmp/deploy/ipk/./core2-64/libnewt-python_0.52.21-r0_core2-64.ipk
/home/pokybuild/yocto-worker/reproducible/build/build-st/reproducibleB/tmp/deploy/ipk/./core2-64/libxml2-dbg_2.9.12-r0_core2-64.ipk
/home/pokybuild/yocto-worker/reproducible/build/build-st/reproducibleB/tmp/deploy/ipk/./core2-64/libxml2-ptest_2.9.12-r0_core2-64.ipk
/home/pokybuild/yocto-worker/reproducible/build/build-st/reproducibleB/tmp/deploy/ipk/./core2-64/libxml2-python_2.9.12-r0_core2-64.ipk
The following rpm packages are missing or different and not in exclusion list: /home/pokybuild/yocto-worker/reproducible/build/build-st/reproducibleB/tmp/deploy/rpm/./core2_64/libnewt-dbg-0.52.21-r0.core2_64.rpm
/home/pokybuild/yocto-worker/reproducible/build/build-st/reproducibleB/tmp/deploy/rpm/./core2_64/libnewt-python-0.52.21-r0.core2_64.rpm
/home/pokybuild/yocto-worker/reproducible/build/build-st/reproducibleB/tmp/deploy/rpm/./core2_64/libxml2-dbg-2.9.12-r0.core2_64.rpm
/home/pokybuild/yocto-worker/reproducible/build/build-st/reproducibleB/tmp/deploy/rpm/./core2_64/libxml2-ptest-2.9.12-r0.core2_64.rpm
/home/pokybuild/yocto-worker/reproducible/build/build-st/reproducibleB/tmp/deploy/rpm/./core2_64/libxml2-python-2.9.12-r0.core2_64.rpm
2021-10-12 00:04:15,441 - oe-selftest - INFO - ----------------------------------------------------------------------
2021-10-12 00:04:15,441 - oe-selftest - INFO - Ran 2 tests in 17939.102s
2021-10-12 00:04:15,441 - oe-selftest - INFO - FAILED
2021-10-12 00:04:15,441 - oe-selftest - INFO -  (failures=1)
2021-10-12 00:04:24,201 - oe-selftest - INFO - RESULTS:
2021-10-12 00:04:24,202 - oe-selftest - INFO - RESULTS - reproducible.DiffoscopeTests.test_diffoscope: PASSED (86.65s)
2021-10-12 00:04:24,203 - oe-selftest - INFO - RESULTS - reproducible.ReproducibleTests.test_reproducible_builds: FAILED (17850.12s)
2021-10-12 00:04:24,595 - oe-selftest - INFO - SUMMARY:
2021-10-12 00:04:24,595 - oe-selftest - INFO - oe-selftest () - Ran 2 tests in 17939.104s
2021-10-12 00:04:24,596 - oe-selftest - INFO - oe-selftest - FAIL - Required tests failed (successes=1, skipped=0, failures=1, errors=0)