Bug 15131

Summary: AB-INT PTEST ARM: python3 'Test_wait', 'test_timeout' failure
Product: [QA/Testing] Package Testing (ptest) Reporter: Alexandre Belloni <alexandre.belloni>
Component: ptestAssignee: Trevor Gamblin <tgamblin>
Status: RESOLVED FIXED QA Contact:
Severity: normal    
Priority: Medium CC: alexandre.belloni, randy.macleod, tim.orling
Version: unspecified   
Target Milestone: 4.3   
Hardware: x86   
OS: Multiple   
Whiteboard: AB-INT
OS type for building Yocto: --- Type of Regression: ---
Verified: Documentation change: No (bug/feature does not impact docs)

Description Alexandre Belloni 2023-06-01 16:23:19 UTC
https://autobuilder.yoctoproject.org/typhoon/#/builders/82/builds/4808/steps/13/logs/stdio

qemuarm64-ptest ubuntu1804-arm-1

======================================================================
FAIL: test_timeout (test.test_multiprocessing_forkserver.WithManagerTestBarrier.test_timeout)
Test wait(timeout)
----------------------------------------------------------------------
Traceback (most recent call last):
  File "/usr/lib/python3.11/test/_test_multiprocessing.py", line 2013, in test_timeout
    self.assertEqual(len(results), self.barrier.parties)
AssertionError: 0 != 5

----------------------------------------------------------------------
Ran 375 tests in 103.356s

FAILED (failures=1, skipped=36)
Comment 1 Tim Orling 2023-06-08 14:45:19 UTC
I believe this is the specific test case:
https://github.com/python/cpython/blob/3.11/Lib/test/_test_multiprocessing.py#L2006
Comment 2 Randy MacLeod 2023-08-03 14:54:34 UTC
If it's a timeout, please put it on a disabled list.
Comment 3 Trevor Gamblin 2023-08-10 14:52:05 UTC
Patch merged that should fix this: https://git.yoctoproject.org/poky/commit/?id=e56b895866c941a71fd495727e360c534b5c9898