| Summary: | AB-INT PTEST: strace filtering_syscall test failure | ||
|---|---|---|---|
| Product: | [QA/Testing] Package Testing (ptest) | Reporter: | João Marcos Costa <joaomarcos.costa> |
| Component: | ptest | Assignee: | Randy MacLeod <randy.macleod> |
| Status: | RESOLVED WORKSFORME | QA Contact: | |
| Severity: | normal | ||
| Priority: | Medium | CC: | alexandre.belloni, randy.macleod |
| Version: | unspecified | ||
| Target Milestone: | 5.1 | ||
| Hardware: | x86 | ||
| OS: | Multiple | ||
| Whiteboard: | AB-INT | ||
| OS type for building Yocto: | --- | Type of Regression: | --- |
| Verified: | Documentation change: | Don't know | |
AssertionError:
Failed ptests:
{'strace': ['filtering_syscall-syntax.test', 'filtering_syscall-syntax']}
https://autobuilder.yoctoproject.org/typhoon/#/builders/82/builds/6244/steps/12/logs/stdio
qemuarm64-ptest ubuntu2204-arm-1
https://autobuilder.yoctoproject.org/typhoon/#/builders/82/builds/6656/steps/12/logs/stdio qemuarm64-ptest ubuntu2204-arm-1 https://autobuilder.yoctoproject.org/typhoon/#/builders/81/builds/6843/steps/12/logs/stdio qemux86-64-ptest fedora38-ty-6 Failed ptests:
{'strace': ['trace_personality_32.gen.test',
'filtering_syscall-syntax.test',
'trace_personality_32.gen',
'filtering_syscall-syntax']}
https://autobuilder.yoctoproject.org/typhoon/#/builders/82/builds/6732/steps/12/logs/stdio
qemuarm64-ptest ubuntu2204-arm-1
Re-open if seen again. |
WARNING: core-image-ptest-strace-1.0-r0 do_testimage: There were failing ptests. Traceback (most recent call last): File "/home/pokybuild/yocto-worker/qemuarm64-ptest/build/meta/lib/oeqa/core/decorator/__init__.py", line 35, in wrapped_f return func(*args, **kwargs) File "/home/pokybuild/yocto-worker/qemuarm64-ptest/build/meta/lib/oeqa/core/decorator/__init__.py", line 35, in wrapped_f return func(*args, **kwargs) File "/home/pokybuild/yocto-worker/qemuarm64-ptest/build/meta/lib/oeqa/core/decorator/__init__.py", line 35, in wrapped_f return func(*args, **kwargs) File "/home/pokybuild/yocto-worker/qemuarm64-ptest/build/meta/lib/oeqa/runtime/cases/ptest.py", line 27, in test_ptestrunner_expectfail self.do_ptestrunner() File "/home/pokybuild/yocto-worker/qemuarm64-ptest/build/meta/lib/oeqa/runtime/cases/ptest.py", line 120, in do_ptestrunner self.fail(failmsg) AssertionError: Failed ptests: {'strace': ['so_peerpidfd.gen.test', 'filtering_syscall-syntax.test', 'so_peerpidfd.gen', 'filtering_syscall-syntax']} https://autobuilder.yoctoproject.org/typhoon/#/builders/82/builds/5517/steps/12/logs/stdio qemuarm64-ptest ubuntu2204-arm-1