Bug 15610

Summary: AB-INT: groff: error: couldn't exec grn: No such file or directory
Product: [QA/Testing] Functional (self) Testing Reporter: Mathieu Dubois-Briand <mathieu.dubois-briand>
Component: generalAssignee: Unassigned <unassigned>
Status: RESOLVED FIXED QA Contact:
Severity: normal    
Priority: Medium CC: ross.burton, tim.orling
Version: unspecified   
Target Milestone: 5.2   
Hardware: x86   
OS: Multiple   
Whiteboard: AB-INT
OS type for building Yocto: --- Type of Regression: ---
Verified: Documentation change: No (bug/feature does not impact docs)

Description Mathieu Dubois-Briand 2024-10-04 16:26:02 UTC
Saw once on the autobuilder, during qemuarm64 test on stream8-ty-1.

| /home/pokybuild/yocto-worker/qemuarm64/build/build/tmp/work/x86_64-linux/groff-native/1.23.0/groff-1.23.0/groff: error: couldn't exec grn: No such file or directory
| /home/pokybuild/yocto-worker/qemuarm64/build/build/tmp/work/x86_64-linux/groff-native/1.23.0/groff-1.23.0/groff: error: couldn't exec grn: No such file or directory
| grops:<standard input>:(<standard input>):7: fatal error: 'V' command invalid before first 'p' command
| grops:<standard input>:(<standard input>):7: fatal error: 'V' command invalid before first 'p' command
| make[1]: *** [Makefile:13990: contrib/hdtbl/examples/chess_board.ps] Error 5
| make[1]: *** Deleting file 'contrib/hdtbl/examples/chess_board.ps'
| make[1]: *** Waiting for unfinished jobs....
| make[1]: *** [Makefile:13990: contrib/hdtbl/examples/color_boxes.ps] Error 5
| make[1]: *** Deleting file 'contrib/hdtbl/examples/color_boxes.ps'
| make[1]: Leaving directory '/home/pokybuild/yocto-worker/qemuarm64/build/build/tmp/work/x86_64-linux/groff-native/1.23.0/groff-1.23.0'
| make: *** [Makefile:6107: all] Error 2
| ERROR: oe_runmake failed

https://autobuilder.yoctoproject.org/typhoon/#/builders/42/builds/9249/steps/14/logs/stdio
Comment 1 Ross Burton 2024-10-10 17:01:02 UTC
Notably, this failed three months ago and the commit that broke is part of styhead.
Comment 2 Ross Burton 2024-10-10 17:12:07 UTC
Confirmed this is a Makefile race.
Comment 3 Ross Burton 2024-10-10 17:36:17 UTC
https://savannah.gnu.org/bugs/?66316
Comment 4 Ross Burton 2024-10-14 12:23:36 UTC
Patch on the list.
Comment 5 Mathieu Dubois-Briand 2024-10-16 15:45:11 UTC
meta-intel debian12-vk-3
https://valkyrie.yoctoproject.org/#/builders/41/builds/229/steps/12/logs/stdio
Comment 6 Ross Burton 2024-10-16 16:02:05 UTC
Merged in d590a32423d05cefc4e7282f971f633b3fa0b941.