| Summary: | AB-INT: test_sstate_nativesdk_samesigs_multilib: AssertionError | ||
|---|---|---|---|
| Product: | [QA/Testing] Functional (self) Testing | Reporter: | Mathieu Dubois-Briand <mathieu.dubois-briand> |
| Component: | oe-selftest | Assignee: | Unassigned <unassigned> |
| Status: | RESOLVED WORKSFORME | QA Contact: | |
| Severity: | normal | ||
| Priority: | Medium | CC: | randy.macleod |
| Version: | unspecified | ||
| Target Milestone: | 5.3 | ||
| Hardware: | x86 | ||
| OS: | Multiple | ||
| Whiteboard: | AB-INT | ||
| OS type for building Yocto: | --- | Type of Regression: | --- |
| Verified: | Documentation change: | Don't know | |
oe-selftest-centos rocky9-vk-3 master-next completed at 2025-02-26T01:14:10Z https://autobuilder.yoctoproject.org/valkyrie/#/builders/76/builds/1035/steps/14/logs/stdio oe-selftest-armhost ubuntu2404-vk-arm1 master-next completed at 2025-03-07T19:54:07Z https://autobuilder.yoctoproject.org/valkyrie/#/builders/23/builds/1189/steps/14/logs/stdio oe-selftest-fedora fedora41-vk-1 master-next completed at 2025-03-07T18:34:01Z https://autobuilder.yoctoproject.org/valkyrie/#/builders/48/builds/1057/steps/14/logs/stdio oe-selftest-centos rocky8-vk-1 master-next completed at 2025-03-07T19:11:52Z https://autobuilder.yoctoproject.org/valkyrie/#/builders/76/builds/1097/steps/15/logs/stdio oe-selftest-ubuntu ubuntu2410-vk-1 master-next completed at 2025-03-07T18:37:38Z https://autobuilder.yoctoproject.org/valkyrie/#/builders/54/builds/1143/steps/14/logs/stdio oe-selftest-debian debian12-vk-8 master-next completed at 2025-03-07T18:38:46Z https://autobuilder.yoctoproject.org/valkyrie/#/builders/35/builds/1108/steps/14/logs/stdio (In reply to Mathieu Dubois-Briand from comment #2) > oe-selftest-armhost ubuntu2404-vk-arm1 master-next completed at > 2025-03-07T19:54:07Z > https://autobuilder.yoctoproject.org/valkyrie/#/builders/23/builds/1189/ > steps/14/logs/stdio > > oe-selftest-fedora fedora41-vk-1 master-next completed at > 2025-03-07T18:34:01Z > https://autobuilder.yoctoproject.org/valkyrie/#/builders/48/builds/1057/ > steps/14/logs/stdio > > oe-selftest-centos rocky8-vk-1 master-next completed at 2025-03-07T19:11:52Z > https://autobuilder.yoctoproject.org/valkyrie/#/builders/76/builds/1097/ > steps/15/logs/stdio > > oe-selftest-ubuntu ubuntu2410-vk-1 master-next completed at > 2025-03-07T18:37:38Z > https://autobuilder.yoctoproject.org/valkyrie/#/builders/54/builds/1143/ > steps/14/logs/stdio > > oe-selftest-debian debian12-vk-8 master-next completed at > 2025-03-07T18:38:46Z > https://autobuilder.yoctoproject.org/valkyrie/#/builders/35/builds/1108/ > steps/14/logs/stdio Forget all logs from my last message, these were related to a patch in master-next. Hasn't happened in almost a year. Re-open if seen again. |
We only had this one once. I waited a bit to see if it occurred again, but not so far. I'm opening a ticket to track it. 1783 2025-02-26 00:18:37,901 - oe-selftest - INFO - 3: 23/25 467/616 (410.30s) (0 failed) (sstatetests.SStateHashSameSigs2.test_sstate_nativesdk_samesigs_multilib) 1784 2025-02-26 00:18:37,901 - oe-selftest - INFO - testtools.testresult.real._StringException: Traceback (most recent call last): 1785 File "/srv/pokybuild/yocto-worker/oe-selftest-centos/build/meta/lib/oeqa/selftest/cases/sstatetests.py", line 504, in test_sstate_nativesdk_samesigs_multilib 1786 self.sstate_common_samesigs(configA, configB) 1787 File "/srv/pokybuild/yocto-worker/oe-selftest-centos/build/meta/lib/oeqa/selftest/cases/sstatetests.py", line 213, in sstate_common_samesigs 1788 self.assertEqual(files1, files2) 1789 File "/usr/lib64/python3.9/unittest/case.py", line 837, in assertEqual 1790 assertion_func(first, second, msg=msg) 1791 File "/usr/lib64/python3.9/unittest/case.py", line 1136, in assertDictEqual 1792 self.fail(self._formatMessage(msg, standardMsg)) 1793 File "/usr/lib64/python3.9/unittest/case.py", line 676, in fail 1794 raise self.failureException(msg) 1795 AssertionError: {'nat[950 chars]y/do_prepare_recipe_sysroot': 'b004650da4588a2[200464 chars]3ac'} != {'nat[950 chars]y/do_compile': '1ebb8f83595643ed24f033294c0013[214086 chars]3ac'} 1796 {'nativesdk-acl/do_collect_spdx_deps': '52ce4dcf6b4663eca1cd13ed6cb69e229bbe525a637563cc2192645493c9a2f9', 1797 'nativesdk-acl/do_compile': '8fa48d34dbb26027e46326fd440679e79485a8c65b668b25ed36235dc8c20f8f', 1798 'nativesdk-acl/do_configure': 'e192cb3340360e728cb4fb454f60c076d85d87c72f7f696b14521d04b3c35a77', 1799 'nativesdk-acl/do_create_package_spdx': 'd6c3a72f6a855dbdcba0fe1af74f31ef1dc3a372624decd642fbc1ae39d5e8da', 1800 'nativesdk-acl/do_create_spdx': 'fba11d313e0ed1ec1bd66d5ed892a22858d6f4a64c6ba8d40596d56c6ab12bb5', 1801 + 'nativesdk-acl/do_deploy_source_date_epoch': '5181d9178d2fed6b50e794c1290d6d8aaa9c445d4729b30e9097ffe782a3a081', 1802 'nativesdk-acl/do_fetch': '00a4f203a882f6aa7d906bee6d7fbdd9a0854b5187a170eb0b0c78c185d8e4b5', 1803 'nativesdk-acl/do_install': 'f756c9f5831876e9553d39b17efa3a205b36cbec7afe0bb4405380b408052c44', 1804 'nativesdk-acl/do_package': 'cb4a3fdde37a2aa449b0433e89c156ecfdc5ef60e48fbfb2b61fea570781d5bc', 1805 'nativesdk-acl/do_package_qa': '44f9d4120f0bcea5996546d4d455c49367f04924cb3ba070dc0a162eca4c4499', 1806 'nativesdk-acl/do_package_write_rpm': '189a7167cdcc97640b98d403ea64e4d3c59b6ebbe8f5514025bb9658e2b42943', ...