Bug 16372

Summary: AB-INT: bblayers.BitbakeLayers.test_bitbakelayers_showcrossdepends fails
Product: [QA/Testing] Functional (self) Testing Reporter: Mathieu Dubois-Briand <mathieu.dubois-briand>
Component: oe-selftestAssignee: Unassigned <unassigned>
Status: NEW --- QA Contact:
Severity: normal    
Priority: Medium CC: randy.macleod
Version: unspecified   
Target Milestone: 6.1   
Hardware: x86   
OS: Multiple   
Whiteboard: AB-INT
OS type for building Yocto: --- Type of Regression: ---
Verified: Documentation change: No (bug/feature does not impact docs)

Description Mathieu Dubois-Briand 2026-07-22 15:07:55 UTC
So the issue is seen during the selftest, but I'm not sure if the issue is really there or something inside bitbake. Also, we have a similar failures on two tests:
- bblayers.BitbakeLayers.test_bitbakelayers_showcrossdepends
- bblayers.BitbakeLayers.test_bitbakelayers_showoverlayed

2026-07-14 01:28:32,893 - oe-selftest - INFO - bblayers.BitbakeLayers.test_bitbakelayers_showcrossdepends (subunit.RemotedTestCase)
2026-07-14 01:28:32,894 - oe-selftest - INFO -  ... FAIL

Stderr:
2026-07-14 01:23:42,305 - oe-selftest - INFO - Adding: "include selftest.inc" in /srv/pokybuild/yocto-worker/oe-selftest-fedora/build/build-st-3296643/conf/local.conf
2026-07-14 01:23:42,306 - oe-selftest - INFO - Adding: "include bblayers.inc" in bblayers.conf
/usr/lib64/python3.14/unittest/case.py:606: RuntimeWarning: TestResult has no addDuration method
  warnings.warn("TestResult has no addDuration method",

/usr/lib64/python3.14/unittest/case.py:606: RuntimeWarning: TestResult has no addDuration method
  warnings.warn("TestResult has no addDuration method",

/usr/lib64/python3.14/unittest/case.py:606: RuntimeWarning: TestResult has no addDuration method
  warnings.warn("TestResult has no addDuration method",

2026-07-14 01:28:32,895 - oe-selftest - INFO - 6: 7/29 69/693 (123.44s) (0 failed) (bblayers.BitbakeLayers.test_bitbakelayers_showcrossdepends)
2026-07-14 01:28:32,895 - oe-selftest - INFO - testtools.testresult.real._StringException: Traceback (most recent call last):
  File "/srv/pokybuild/yocto-worker/oe-selftest-fedora/build/layers/openembedded-core/meta/lib/oeqa/selftest/cases/bblayers.py", line 35, in test_bitbakelayers_showcrossdepends
    result = runCmd('bitbake-layers show-cross-depends')
  File "/srv/pokybuild/yocto-worker/oe-selftest-fedora/build/layers/openembedded-core/meta/lib/oeqa/utils/commands.py", line 214, in runCmd
    raise AssertionError("Command '%s' returned non-zero exit status %d:\n%s" % (command, result.status, exc_output))
AssertionError: Command 'bitbake-layers show-cross-depends' returned non-zero exit status 1:
NOTE: Reconnecting to bitbake server...
Loading cache...done.
Loaded 2077 entries from dependency cache.
NOTE: No reply from server in 30s (for command getRecipeInherits at 01:27:02.486757)
NOTE: No reply from server in 30s (for command clientComplete at 01:28:02.546967)
Timeout while waiting for a reply from the bitbake server (60s at 01:28:32.556884)
Comment 1 Mathieu Dubois-Briand 2026-07-22 15:08:52 UTC
oe-selftest-fedora fedora43-vk-2 master completed at 2026-07-14 03:21:06+00:00
https://autobuilder.yoctoproject.org/valkyrie/#/builders/48/builds/4100/steps/15/logs/stdio
Comment 2 Randy MacLeod 2026-07-23 14:48:53 UTC
Need the cooker log if this happens again.
Likely load related.