Bug 16452

Summary: AB-INT: test_sdk_none_nfs_qemu: lldb connection failed
Product: [QA/Testing] Functional (self) Testing Reporter: Mathieu Dubois-Briand <mathieu.dubois-briand>
Component: generalAssignee: Adrian Freihofer <adrian.freihofer>
Status: NEW --- QA Contact:
Severity: normal    
Priority: Medium+ CC: randy.macleod
Version: unspecified   
Target Milestone: 6.2 M1   
Hardware: x86   
OS: Multiple   
Whiteboard: AB-INT
OS type for building Yocto: --- Type of Regression: ---
Verified: Documentation change: No (bug/feature does not impact docs)

Description Mathieu Dubois-Briand 2026-10-15 07:22:30 UTC
Connection to the lldb server timed out during the test:


> 2026-10-14 01:36:43,191 - oe-selftest - INFO - devtool.DevtoolIdeSdkClangTests.test_sdk_none_nfs_qemu (subunit.RemotedTestCase)
> 2026-10-14 01:36:43,192 - oe-selftest - INFO -  ... FAIL
> ...
> 2026-10-14 01:36:43,192 - oe-selftest - INFO - 11: 4/72 347/769 (351.08s) (0 failed) (devtool.DevtoolIdeSdkClangTests.test_sdk_none_nfs_qemu)
> 2026-10-14 01:36:43,192 - oe-selftest - INFO - testtools.testresult.real._StringException: Traceback (most recent call last):
>   File "/srv/pokybuild/yocto-worker/oe-selftest-fedora/build/layers/openembedded-core/meta/lib/oeqa/selftest/cases/devtool.py", line 5155, in test_sdk_none_nfs_qemu
>     self._test_code_and_none_qemu(nfs=True)
>     ~~~~~~~~~~~~~~~~~~~~~~~~~~~~~^^^^^^^^^^
>   File "/srv/pokybuild/yocto-worker/oe-selftest-fedora/build/layers/openembedded-core/meta/lib/oeqa/selftest/cases/devtool.py", line 3744, in _test_code_and_none_qemu
>     self._verify_recipe_ide_sdk(
>     ~~~~~~~~~~~~~~~~~~~~~~~~~~~^
>         tempdir_cmake, qemu, self._cmake_recipe_name, self._cmake_recipe_name, compile_cmd)
>         ^^^^^^^^^^^^^^^^^^^^^^^^^^^^^^^^^^^^^^^^^^^^^^^^^^^^^^^^^^^^^^^^^^^^^^^^^^^^^^^^^^^
>   File "/srv/pokybuild/yocto-worker/oe-selftest-fedora/build/layers/openembedded-core/meta/lib/oeqa/selftest/cases/devtool.py", line 4689, in _verify_recipe_ide_sdk
>     self._lldb_server_debugging_once(
>     ~~~~~~~~~~~~~~~~~~~~~~~~~~~~~~~~^
>         tempdir, qemu, DevtoolIdeSdkTests.MAGIC_STRING_ORIG)
>         ^^^^^^^^^^^^^^^^^^^^^^^^^^^^^^^^^^^^^^^^^^^^^^^^^^^^
>   File "/srv/pokybuild/yocto-worker/oe-selftest-fedora/build/layers/openembedded-core/meta/lib/oeqa/selftest/cases/devtool.py", line 5053, in _lldb_server_debugging_once
>     r = runCmd(lldb_batch, output_log=self._cmd_logger)
>   File "/srv/pokybuild/yocto-worker/oe-selftest-fedora/build/layers/openembedded-core/meta/lib/oeqa/utils/commands.py", line 214, in runCmd
>     raise AssertionError("Command '%s' returned non-zero exit status %d:\n%s" % (command, result.status, exc_output))
> AssertionError: Command '['/srv/pokybuild/yocto-worker/oe-selftest-fedora/build/build-st-765957/tmp/work/x86_64-linux/lldb-native/23.1.2/recipe-sysroot-native/usr/bin/lldb', '--batch', '-o', 'platform select remote-linux', '-o', 'platform connect connect://192.168.7.2:1234', '-o', 'settings set target.process.thread.step-avoid-regexp ""', '-o', 'settings set target.debug-file-search-paths /srv/pokybuild/yocto-worker/oe-selftest-fedora/build/build-st-765957/tmp/work/x86-64-v3-poky-linux/cmake-example-clang/1.0/image/usr/lib /srv/pokybuild/yocto-worker/oe-selftest-fedora/build/build-st-765957/tmp/work/x86-64-v3-poky-linux/cmake-example-clang/1.0/image/usr/bin /srv/pokybuild/yocto-worker/oe-selftest-fedora/build/build-st-765957/workspace/nfs-exports/oe-selftest-image/rootfs-dbg/lib/.debug /srv/pokybuild/yocto-worker/oe-selftest-fedora/build/build-st-765957/workspace/nfs-exports/oe-selftest-image/rootfs-dbg/usr/lib/.debug /srv/pokybuild/yocto-worker/oe-selftest-fedora/build/build-st-765957/workspace/nfs-exports/oe-selftest-image/rootfs-dbg/usr/lib/debug /srv/pokybuild/yocto-worker/oe-selftest-fedora/build/build-st-765957/workspace/nfs-exports/oe-selftest-image/rootfs-dbg/lib /srv/pokybuild/yocto-worker/oe-selftest-fedora/build/build-st-765957/workspace/nfs-exports/oe-selftest-image/rootfs-dbg/usr/lib /srv/pokybuild/yocto-worker/oe-selftest-fedora/build/build-st-765957/tmp/work/qemux86_64-poky-linux/oe-selftest-image/1.0/rootfs/lib /srv/pokybuild/yocto-worker/oe-selftest-fedora/build/build-st-765957/tmp/work/qemux86_64-poky-linux/oe-selftest-image/1.0/rootfs/usr/lib', '-o', 'settings set target.exec-search-paths /srv/pokybuild/yocto-worker/oe-selftest-fedora/build/build-st-765957/tmp/work/x86-64-v3-poky-linux/cmake-example-clang/1.0/image/usr/lib /srv/pokybuild/yocto-worker/oe-selftest-fedora/build/build-st-765957/tmp/work/x86-64-v3-poky-linux/cmake-example-clang/1.0/image/lib /srv/pokybuild/yocto-worker/oe-selftest-fedora/build/build-st-765957/tmp/work/x86-64-v3-poky-linux/cmake-example-clang/1.0/image/usr/bin', '-o', 'target create --remote-file /usr/bin/cmake-example-clang /srv/pokybuild/yocto-worker/oe-selftest-fedora/build/build-st-765957/tmp/work/x86-64-v3-poky-linux/cmake-example-clang/1.0/image/usr/bin/cmake-example-clang', '-o', 'settings set target.source-map /usr/include /srv/pokybuild/yocto-worker/oe-selftest-fedora/build/build-st-765957/tmp/work/x86-64-v3-poky-linux/cmake-example-clang/1.0/recipe-sysroot/usr/include /usr/src/debug/cmake-example-clang/1.0 /tmp/devtoolqayjacpldd /usr/src/debug /srv/pokybuild/yocto-worker/oe-selftest-fedora/build/build-st-765957/workspace/nfs-exports/oe-selftest-image/rootfs-dbg/usr/src/debug', '-o', 'breakpoint set --file cpp-example.cpp --line 114', '-o', 'breakpoint set --file cpp-example-lib.cpp --line 31', '-o', 'breakpoint set --file cpp-example-lib.hpp --line 24', '-o', 'breakpoint list', '-o', 'run', '-o', 'p cpp_example.get_string()', '-o', 'continue', '-o', 'p flag', '-o', 'continue', '-o', 'p n', '-o', 'continue', '-o', 'exit']' returned non-zero exit status 1:
> (lldb) platform select remote-linux
>   Platform: remote-linux
>  Connected: no
> (lldb) platform connect connect://192.168.7.2:1234
> error: failed to get reply to handshake packet within timeout of 6.0 seconds
Comment 1 Mathieu Dubois-Briand 2026-10-15 07:23:18 UTC
oe-selftest-fedora alma8-vk-1 master completed at 2026-10-14 02:45:15+00:00
https://autobuilder.yoctoproject.org/valkyrie/#/builders/48/builds/4867/steps/18/logs/stdio