Bug 2470

Summary: qemux86 meta-toolchain-gmae build failed due to telepathy-glib_0.18 compile error
Product: [Build System, Metadata & Runtime] OE-Core Reporter: Jiajun Xu <jiajun.xu>
Component: coreAssignee: Saul Wold <sgw>
Status: RESOLVED DUPLICATE QA Contact:
Severity: normal    
Priority: Undecided CC: hongnax.xu, meta.mr.watcher, meta.watcher, yi.zhao, yilongx.y.sun
Version: unspecified   
Target Milestone: ---   
Hardware: x86   
OS: Multiple   
Whiteboard:
OS type for building Yocto: --- Type of Regression: ---
Verified: Documentation change: ---

Description Jiajun Xu 2012-05-18 01:31:41 UTC
tree/branch: poky/master
commit: f3ba3cb6af96aebf5167bb1565edf11cceb7897f

On autobuilder, the qemux86 meta-toolchain-gmae build failed. It reports that "/bin/sh: line 1: _gen/reentrant-methods.list.tmp: No such file or directory" for telepathy-glib_0.18. Error log could be found on http://autobuilder.pokylinux.org:8010/builders/nightly-x86/builds/486/steps/shell_51/logs/stdio.

Detailed error log as below:
########
ERROR: Function failed: do_compile (see /srv/home/pokybuild/yocto-autobuilder/yocto-slave/nightly-x86/build/build/tmp/work/i586-poky-linux/telepathy-glib-0.18.1-r0/temp/log.do_compile.8537 for further information)
ERROR: Logfile of failure stored in: /srv/home/pokybuild/yocto-autobuilder/yocto-slave/nightly-x86/build/build/tmp/work/i586-poky-linux/telepathy-glib-0.18.1-r0/temp/log.do_compile.8537
Log data follows:
| DEBUG: SITE files ['endian-little', 'bit-32', 'ix86-common', 'common-linux', 'common-glibc', 'i586-linux', 'common']
| NOTE: make -j 16
| make  all-recursive
| make[1]: Entering directory `/srv/home/pokybuild/yocto-autobuilder/yocto-slave/nightly-x86/build/build/tmp/work/i586-poky-linux/telepathy-glib-0.18.1-r0/telepathy-glib-0.18.1'
| Making all in m4
| make[2]: Entering directory `/srv/home/pokybuild/yocto-autobuilder/yocto-slave/nightly-x86/build/build/tmp/work/i586-poky-linux/telepathy-glib-0.18.1-r0/telepathy-glib-0.18.1/m4'
| make[2]: Nothing to be done for `all'.
| make[2]: Leaving directory `/srv/home/pokybuild/yocto-autobuilder/yocto-slave/nightly-x86/build/build/tmp/work/i586-poky-linux/telepathy-glib-0.18.1-r0/telepathy-glib-0.18.1/m4'
| Making all in tools
| make[2]: Entering directory `/srv/home/pokybuild/yocto-autobuilder/yocto-slave/nightly-x86/build/build/tmp/work/i586-poky-linux/telepathy-glib-0.18.1-r0/telepathy-glib-0.18.1/tools'
| sed -e 's![@]abs_top_builddir[@]!/srv/home/pokybuild/yocto-autobuilder/yocto-slave/nightly-x86/build/build/tmp/work/i586-poky-linux/telepathy-glib-0.18.1-r0/telepathy-glib-0.18.1!' telepathy-glib-env.in > telepathy-glib-env
| chmod +x telepathy-glib-env
| make[2]: Leaving directory `/srv/home/pokybuild/yocto-autobuilder/yocto-slave/nightly-x86/build/build/tmp/work/i586-poky-linux/telepathy-glib-0.18.1-r0/telepathy-glib-0.18.1/tools'
| Making all in spec
| make[2]: Entering directory `/srv/home/pokybuild/yocto-autobuilder/yocto-slave/nightly-x86/build/build/tmp/work/i586-poky-linux/telepathy-glib-0.18.1-r0/telepathy-glib-0.18.1/spec'
| make[2]: Nothing to be done for `all'.
| make[2]: Leaving directory `/srv/home/pokybuild/yocto-autobuilder/yocto-slave/nightly-x86/build/build/tmp/work/i586-poky-linux/telepathy-glib-0.18.1-r0/telepathy-glib-0.18.1/spec'
| Making all in telepathy-glib
| make[2]: Entering directory `/srv/home/pokybuild/yocto-autobuilder/yocto-slave/nightly-x86/build/build/tmp/work/i586-poky-linux/telepathy-glib-0.18.1-r0/telepathy-glib-0.18.1/telepathy-glib'
| /bin/mkdir -p _gen
| ( cd . && cat versions/0.7.0.abi versions/0.7.1.abi versions/0.7.2.abi versions/0.7.3.abi versions/0.7.5.abi versions/0.7.6.abi versions/0.7.7.abi versions/0.7.8.abi versions/0.7.9.abi versions/0.7.10.abi versions/0.7.12.abi versions/0.7.13.abi versions/0.7.14.abi versions/0.7.15.abi versions/0.7.16.abi versions/0.7.17.abi versions/0.7.18.abi versions/0.7.19.abi versions/0.7.20.abi versions/0.7.21.abi versions/0.7.23.abi versions/0.7.24.abi versions/0.7.26.abi versions/0.7.27.abi versions/0.7.28.abi versions/0.7.29.abi versions/0.7.30.abi versions/0.7.31.abi versions/0.7.32.abi versions/0.7.34.abi versions/0.7.35.abi versions/0.7.36.abi versions/0.7.37.abi versions/0.9.0.abi versions/0.9.2.abi versions/0.11.0.abi versions/0.11.1.abi versions/0.11.3.abi versions/0.11.4.abi versions/0.11.5.abi versions/0.11.6.abi versions/0.11.7.abi versions/0.11.9.abi versions/0.11.11.abi versions/0.11.12.abi versions/0.11.13.abi versions/0.11.14.abi versions/0.11.15.abi versions/0.11.16.abi versions/0.13.0.abi versions/0.13.1.abi versions/0.13.2.abi versions/0.13.3.abi versions/0.13.4.abi versions/0.13.5.abi versions/0.13.7.abi versions/0.13.8.abi versions/0.13.9.abi versions/0.13.10.abi versions/0.13.11.abi versions/0.13.12.abi versions/0.13.13.abi versions/0.13.14.abi versions/0.13.15.abi versions/0.13.16.abi versions/0.14.1.abi versions/0.14.3.abi versions/0.14.4.abi versions/0.14.5.abi versions/0.15.0.abi versions/0.15.1.abi versions/0.15.2.abi versions/0.15.3.abi versions/0.15.5.abi versions/0.15.6.abi versions/0.15.8.abi versions/0.17.0.abi versions/0.17.1.abi versions/0.17.2.abi versions/0.17.3.abi versions/0.17.5.abi versions/0.17.6.abi versions/0.17.7.abi versions/0.18.0.abi  ) | \
| 	/usr/bin/grep '^tp_cli_.*_run_.*' > _gen/reentrant-methods.list.tmp
| /bin/sh: line 1: _gen/reentrant-methods.list.tmp: No such file or directory
| make[2]: *** [_gen/reentrant-methods.list] Error 1
| make[2]: *** Waiting for unfinished jobs....
| touch _gen/spec-stamp
| make[2]: Leaving directory `/srv/home/pokybuild/yocto-autobuilder/yocto-slave/nightly-x86/build/build/tmp/work/i586-poky-linux/telepathy-glib-0.18.1-r0/telepathy-glib-0.18.1/telepathy-glib'
| make[1]: *** [all-recERROR: Function failed: do_compile (see /srv/home/pokybuild/yocto-autobuilder/yocto-slave/nightly-x86/build/build/tmp/work/i586-poky-linux/telepathy-glib-0.18.1-r0/temp/log.do_compile.8537 for further information)
| ursive] Error 1
| make[1]: Leaving directory `/srv/home/pokybuild/yocto-autobuilder/yocto-slave/nightly-x86/build/build/tmp/work/i586-poky-linux/telepathy-glib-0.18.1-r0/telepathy-glib-0.18.1'
| make: *** [all] Error 2
| ERROR: oe_runmake failed
NOTE: package telepathy-glib-0.18.1-r0: task do_compile: Failed
ERROR: Task 913 (/srv/home/pokybuild/yocto-autobuilder/yocto-slave/nightly-x86/build/meta/recipes-connectivity/telepathy/telepathy-glib_0.18.1.bb, do_compile) failed with exit 
########
Comment 1 Saul Wold 2012-05-18 06:29:13 UTC
I already filed this bug, please attempt to look for dups.

*** This bug has been marked as a duplicate of bug 2462 ***