Bug 3745

Summary: [Test Case 169] Bitbake remake/remake-native check
Product: [Build System, Metadata & Runtime] OE-Core Reporter: Stoicescu Cornel <corneliux.stoicescu>
Component: devtools / tool chainAssignee: Saul Wold <sgw>
Status: VERIFIED FIXED QA Contact:
Severity: normal    
Priority: Medium CC: meta.mr.watcher, meta.watcher, poky.bs.watcher, poky.watcher, sgw
Version: 1.4   
Target Milestone: 1.4   
Hardware: x86   
OS: Multiple   
Whiteboard:
OS type for building Yocto: --- Type of Regression: ---
Verified: Documentation change: ---
Attachments:
Description Flags
log.do_compile none

Description Stoicescu Cornel 2013-01-17 12:01:53 UTC
Created attachment 1015 [details]
log.do_compile

STATUS: FAILED
BUILD: master:9eb88ceb39b7d0b8ddc6487e61ce8edadef10ec4
ENVIRONMENT: Ubuntu 12.04 x86_64
STEPS TO REPRODUCE: 1.Set build enverionment.
2.Run "bitbake remake".
3.Run "bitbake remake-native"

EXPECTED OUTCOME: Both recipes could be successfully built.

Actual outcome:

ERROR: Function failed: do_compile (see /home/cornel/SDD/Yocto/poky/build/tmp/work/x86_64-poky-linux/remake/git-r0/temp/log.do_compile.3650 for further information)
ERROR: Logfile of failure stored in: /home/cornel/SDD/Yocto/poky/build/tmp/work/x86_64-poky-linux/remake/git-r0/temp/log.do_compile.3650
Log data follows:
| DEBUG: SITE files ['endian-little', 'common-linux', 'common-glibc', 'bit-64', 'x86_64-linux', 'common']
| DEBUG: Executing shell function do_compile
| [ -d "po" ] && make do-po-update
| make[1]: Entering directory `/home/cornel/SDD/Yocto/poky/build/tmp/work/x86_64-poky-linux/remake/git-r0/git'
| tmppo="/tmp/po-remake-3.82+dbg0.9dev.$$" \
|         && rm -rf "$tmppo" \
|         && mkdir "$tmppo" \
|         && (cd "$tmppo" \
|               && wget --passive-ftp -nv --recursive --level=1 --no-directories --no-parent --no-check-certificate -A '*.po' http://translationproject.org/latest/make) \
|         && cp "$tmppo"/*.po ./po && rm -rf "$tmppo"
| make[1]: *** [do-po-update] Error 4
| make[1]: Leaving directory `/home/cornel/SDD/Yocto/poky/build/tmp/work/x86_64-poky-linux/remake/git-r0/git'
| make: *** [po-update] Error 2
| ERROR: Function failed: do_compile (see /home/cornel/SDD/Yocto/poky/build/tmp/work/x86_64-poky-linux/remake/git-r0/temp/log.do_compile.3650 for further information)
ERROR: Task 6 (/home/cornel/SDD/Yocto/poky/meta/recipes-devtools/remake/remake_git.bb, do_compile) failed with exit code '1'
NOTE: Tasks Summary: Attempted 550 tasks of which 549 didn't need to be rerun and 1 failed.
Comment 1 Stoicescu Cornel 2013-01-17 14:57:10 UTC
I am behind a proxy and this might be causing the wget to fail. It seems the proxy is not used.
Comment 2 Saul Wold 2013-01-17 15:57:24 UTC
Need to patch the Makefile to remove the check and call of wget to retrieve the updated transations
Comment 4 Stoicescu Cornel 2013-02-21 15:36:28 UTC
Verified in master:7d22ef28e64de06b6238d0ef9b664c0bee6efa46