Bug 3977

Summary: [Test Case 169] Bitbake remake/remake-native check
Product: [Build System, Metadata & Runtime] OE-Core Reporter: Stoicescu Cornel <corneliux.stoicescu>
Component: devtools / tool chainAssignee: Ross Burton <ross.burton>
Status: RESOLVED FIXED QA Contact:
Severity: normal    
Priority: Medium CC: jessica.zhang, meta.mr.watcher, meta.watcher, poky.bs.watcher, poky.watcher, richard.purdie, sgw
Version: 1.3   
Target Milestone: 1.3.2   
Hardware: x86   
OS: Multiple   
Whiteboard:
OS type for building Yocto: --- Type of Regression: ---
Verified: Documentation change: ---

Description Stoicescu Cornel 2013-03-04 15:16:28 UTC
STATUS: FAILED
BUILD: danny:98292d1ef1cb44cf96f0a28fbca6439eda55ce1b
ENVIRONMENT: Ubuntu 12.04 x86_64
STEPS TO REPRODUCE: 1.Set build enverionment.
2.Run "bitbake remake".
3.Run "bitbake remake-native"

EXPECTED OUTCOME: Both recipes could be successfully built.

Actual outcome:

ERROR: Function failed: do_compile (see /home/cornel/work/poky/build/tmp/work/x86_64-poky-linux/remake-git-r0/temp/log.do_compile.7027 for further information)
ERROR: Logfile of failure stored in: /home/cornel/work/poky/build/tmp/work/x86_64-poky-linux/remake-git-r0/temp/log.do_compile.7027
Log data follows:
| DEBUG: SITE files ['endian-little', 'common-linux', 'common-glibc', 'bit-64', 'x86_64-linux', 'common']
| DEBUG: Executing shell function do_compile
| [ -d "po" ] && make do-po-update
| make[1]: Entering directory `/home/cornel/work/poky/build/tmp/work/x86_64-poky-linux/remake-git-r0/git'
| tmppo="/tmp/po-remake-3.82+dbg0.9dev.$$" \
|   && rm -rf "$tmppo" \
|   && mkdir "$tmppo" \
|   && (cd "$tmppo" \
|       && wget --passive-ftp -nv --recursive --level=1 --no-directories --no-parent --no-check-certificate -A '*.po' http://translationproject.org/latest/make) \
|   && cp "$tmppo"/*.po ./po && rm -rf "$tmppo"
| make[1]: *** [do-po-update] Error 4
| make[1]: Leaving directory `/home/cornel/work/poky/build/tmp/work/x86_64-poky-linux/remake-git-r0/git'
| make: *** [po-update] Error 2
| ERROR: Function failed: do_compile (see /home/cornel/work/poky/build/tmp/work/x86_64-poky-linux/remake-git-r0/temp/log.do_compile.7027 for further information)
ERROR: Task 6 (/home/cornel/work/poky/meta/recipes-devtools/remake/remake_git.bb, do_compile) failed with exit code '1'
NOTE: Tasks Summary: Attempted 832 tasks of which 190 didn't need to be rerun and 1 failed.
No currently running tasks (832 of 838)

Summary: 1 task failed:
  /home/cornel/work/poky/meta/recipes-devtools/remake/remake_git.bb, do_compile
Summary: There was 1 ERROR message shown, returning a non-zero exit code.


NOTE: This bug is fixed in master: bug 3745
Comment 1 Ross Burton 2013-03-04 16:01:37 UTC
Cherry-picked to danny-next, will be in 1.3.2.
Comment 2 Ross Burton 2013-04-30 12:01:51 UTC
Merged to danny.