| Summary: |
bitbake world has error on qemumips. alsa/alsa-tools_1.0.26.1.bb compile failed. |
| Product: |
[Build System, Metadata & Runtime] OE-Core
|
Reporter: |
Ning Zhang <ning.zhang> |
| Component: |
core | Assignee: |
Saul Wold <sgw> |
| Status: |
RESOLVED
FIXED
|
QA Contact: |
|
| Severity: |
normal
|
|
|
| Priority: |
Medium
|
CC: |
meta.mr.watcher, meta.watcher, Qi.Chen, yi.zhao
|
| Version: |
1.4 | |
|
| Target Milestone: |
1.4 | |
|
| Hardware: |
x86 | |
|
| OS: |
Multiple | |
|
| Whiteboard: |
|
|
OS type for building Yocto:
|
---
|
Type of Regression:
|
---
|
|
Verified:
|
|
Documentation change:
|
---
|
| Attachments: |
|
Created attachment 1117 [details] build error log branch: poky/master git version: 4da406cd50cf02a63ed76810a670aba1eb561c79 steps: 1. modify conf/local.conf, set MACHINE ?= "qemumips" 2. execute "bitbake world" to build all packages 3. meta/recipes-multimedia/alsa/alsa-tools_1.0.26.1.bb built failed. Detail see below and attached log. ==============error log==================== | mips-poky-linux-gcc -meb -mabi=32 -mhard-float -march=mips32 --sysroot=/home/yocto/20130319/tmp/sysroots/qemumips -DPACKAGE_NAME=\"\" -DPACKAGE_TARNAME=\"\" -DPACKAGE_VERSION=\"\" -DPACKAGE_STRING=\"\" -DPACKAGE_BUGREPORT=\"\" -DPACKAGE_URL=\"\" -DPACKAGE=\"hda-verb\" -DVERSION=\"0.4\" -DSTDC_HEADERS=1 -I. -O2 -Wall -pipe -g -MT hda-verb.o -MD -MP -MF .deps/hda-verb.Tpo -c -o hda-verb.o hda-verb.c | hda-verb.c:17:20: fatal error: sys/io.h: No such file or directory | compilation terminated. | make[1]: *** [hda-verb.o] Error 1 | make[1]: Leaving directory `/home/yocto/20130319/tmp/work/mips32-poky-linux/alsa-tools/1.0.26.1-r0/alsa-tools-1.0.26.1/hda-verb' | make: *** [all] Error 1 | ERROR: oe_runmake failed | ERROR: Function failed: do_compile (see /home/yocto/20130319/tmp/work/mips32-poky-linux/alsa-tools/1.0.26.1-r0/temp/log.do_compile.28809 for further information) ERROR: Task 5270 (/home/yocto/poky/meta/recipes-multimedia/alsa/alsa-tools_1.0.26.1.bb, do_compile) failed with exit code '1' NOTE: Tasks Summary: Attempted 6448 tasks of which 455 didn't need to be rerun and 1 failed. Waiting for 0 running tasks to finish: Summary: 1 task failed: /home/yocto/poky/meta/recipes-multimedia/alsa/alsa-tools_1.0.26.1.bb, do_compile Summary: There was 1 ERROR message shown, returning a non-zero exit code.