Bug 4199

Summary: [Autobuilder] jpeg_8d fails to build on x86_64/nightly-multilib
Product: [Build System, Metadata & Runtime] OE-Core Reporter: Bogdan Marinescu <bogdan.a.marinescu>
Component: coreAssignee: Ross Burton <ross.burton>
Status: RESOLVED FIXED QA Contact:
Severity: normal    
Priority: Medium CC: meta.mr.watcher, meta.watcher, richard.purdie
Version: 1.3.1   
Target Milestone: 1.3.2   
Hardware: x86   
OS: Multiple   
Whiteboard:
OS type for building Yocto: --- Type of Regression: ---
Verified: Documentation change: ---

Description Bogdan Marinescu 2013-04-04 14:44:00 UTC
http://autobuilder.yoctoproject.org:8011/builders/nightly-multilib/builds/87/steps/Building%20Images_1/logs/stdio

| x86_64-poky-linux-libtool: compile: Failed to create `.libs'
| make[1]: *** [jcmarker.lo] Error 1
| /srv/home/pokybuild/yocto-autobuilder-new/yocto-slave/nightly-multilib/build/build/tmp/sysroots/qemux86-64/usr/bin/crossscripts/x86_64-poky-linux-libtool: line 981: /usr/bin/sed: No such file or directory
| x86_64-poky-linux-libtool: compile: Failed to create `.libs'
| /srv/home/pokybuild/yocto-autobuilder-new/yocto-slave/nightly-multilib/build/build/tmp/sysroots/qemux86-64/usr/bin/crossscripts/x86_64-poky-linux-libtool: line 981: /usr/bin/sed: No such file or directory
| make[1]: *** [jcmainct.lo] Error 1
| x86_64-poky-linux-libtool: compile: Failed to create `.libs'
| make[1]: *** [jcmaster.lo] Error 1
| /srv/home/pokybuild/yocto-autobuilder-new/yocto-slave/nightly-multilib/build/build/tmp/sysroots/qemux86-64/usr/bin/crossscripts/x86_64-poky-linux-libtool: line 981: /usr/bin/sed: No such file or directory
| x86_64-poky-linux-libtool: compile: Failed to create `.libs'
| make[1]: *** [jcinit.lo] Error 1
| /srv/home/pokybuild/yocto-autobuilder-new/yocto-slave/nightly-multilib/build/build/tmp/sysroots/qemux86-64/usr/bin/crossscripts/x86_64-poky-linux-libtool: line 981: /usr/bin/sed: No such file or directory
| x86_64-poky-linux-libtool: compile: Failed to create `.libs'
| make[1]: *** [jcomapi.lo] Error 1
| make[1]: Leaving directory `/srv/home/pokybuild/yocto-autobuilder-new/yocto-slave/nightly-multilib/build/build/tmp/work/x86_64-poky-linux/jpeg-8d-r1/jpeg-8d'
| make: *** [all] Error 2
| ERROR: oe_runmake failed
| ERROR: Function failed: do_compile (see /srv/home/pokybuild/yocto-autobuilder-new/yocto-slave/nightly-multilib/build/build/tmp/work/x86_64-poky-linux/jpeg-8d-r1/temp/log.do_compile.17980 for further information)
ERROR: Task 3739 (/srv/home/pokybuild/yocto-autobuilder-new/yocto-slave/nightly-multilib/build/meta/recipes-core/jpeg/jpeg_8d.bb, do_compile) failed with exit code '1'
Summary: There was 1 ERROR message shown, returning a non-zero exit code.
Comment 1 Saul Wold 2013-04-04 15:06:54 UTC
Relocation issue, because of sed being hardcoded in libtools
Comment 4 Ross Burton 2013-04-04 15:56:23 UTC
Merged to my danny-next.
Comment 5 Ross Burton 2013-04-30 11:27:30 UTC
Integrated into danny.