Bug 6459

Summary: lttng-modules recipe fails with kernel 3.14.5
Product: [Build System, Metadata & Runtime] OE-Core Reporter: Nitin Kamble <nitin.a.kamble>
Component: kernelAssignee: Bruce Ashfield <bruce.ashfield>
Status: RESOLVED FIXED QA Contact:
Severity: normal    
Priority: Undecided CC: bruce.ashfield, richard.purdie, tom.zanussi
Version: 1.7   
Target Milestone: ---   
Hardware: x86   
OS: Multiple   
Whiteboard:
OS type for building Yocto: --- Type of Regression: ---
Verified: Documentation change: No (bug/feature does not impact docs)

Description Nitin Kamble 2014-06-18 00:36:22 UTC
https://autobuilder.yoctoproject.org/main/builders/nightly-x86-64-lsb/builds/142/steps/BuildImages/logs/stdio


|   CC [M]  /home/pokybuild/yocto-autobuilder/yocto-slave/nightly-x86-64-lsb/build/build/tmp/work/qemux86_64-poky-linux/lttng-modules/2.4.1-r0/git/probes/lttng-probe-block.o
| In file included from /home/pokybuild/yocto-autobuilder/yocto-slave/nightly-x86-64-lsb/build/build/tmp/work/qemux86_64-poky-linux/lttng-modules/2.4.1-r0/git/probes/../instrumentation/events/lttng-module/../../../probes/define_trace.h:148:0,
|                  from /home/pokybuild/yocto-autobuilder/yocto-slave/nightly-x86-64-lsb/build/build/tmp/work/qemux86_64-poky-linux/lttng-modules/2.4.1-r0/git/probes/../instrumentation/events/lttng-module/block.h:936,
|                  from /home/pokybuild/yocto-autobuilder/yocto-slave/nightly-x86-64-lsb/build/build/tmp/work/qemux86_64-poky-linux/lttng-modules/2.4.1-r0/git/probes/lttng-probe-block.c:42:
| /home/pokybuild/yocto-autobuilder/yocto-slave/nightly-x86-64-lsb/build/build/tmp/work/qemux86_64-poky-linux/lttng-modules/2.4.1-r0/git/probes/../instrumentation/events/lttng-module/../../../probes/lttng-events.h:151:6: error: conflicting types for 'trace_block_rq_complete'
|  void trace_##_name(_proto);
|       ^
| /home/pokybuild/yocto-autobuilder/yocto-slave/nightly-x86-64-lsb/build/build/tmp/work/qemux86_64-poky-linux/lttng-modules/2.4.1-r0/git/probes/../instrumentation/events/lttng-module/../../../probes/lttng-events.h:117:2: note: in expansion of macro 'DEFINE_EVENT_MAP'
|   DEFINE_EVENT_MAP(template, name, name, PARAMS(proto), PARAMS(args))
|   ^
| /home/pokybuild/yocto-autobuilder/yocto-slave/nightly-x86-64-lsb/build/build/tmp/work/qemux86_64-poky-linux/lttng-modules/2.4.1-r0/git/probes/../instrumentation/events/lttng-module/../../../probes/../instrumentation/events/lttng-module/block.h:235:1: note: in expansion of macro 'DEFINE_EVENT'
|  DEFINE_EVENT(block_rq_with_error, block_rq_complete,
|  ^
| In file included from include/linux/module.h:18:0,
|                  from /home/pokybuild/yocto-autobuilder/yocto-slave/nightly-x86-64-lsb/build/build/tmp/work/qemux86_64-poky-linux/lttng-modules/2.4.1-r0/git/probes/lttng-probe-block.c:23:
| include/linux/tracepoint.h:168:21: note: previous definition of 'trace_block_rq_complete' was here
|   static inline void trace_##name(proto)    \
|                      ^
| include/linux/tracepoint.h:265:3: note: in expansion of macro '__DECLARE_TRACE'
|    __DECLARE_TRACE(name, PARAMS(proto), PARAMS(args), 1, \
|    ^
| include/linux/tracepoint.h:399:2: note: in expansion of macro 'DECLARE_TRACE'
|   DECLARE_TRACE(name, PARAMS(proto), PARAMS(args))
|   ^
| include/trace/events/block.h:143:1: note: in expansion of macro 'TRACE_EVENT'
|  TRACE_EVENT(block_rq_complete,
|  ^
| scripts/Makefile.build:314: recipe for target '/home/pokybuild/yocto-autobuilder/yocto-slave/nightly-x86-64-lsb/build/build/tmp/work/qemux86_64-poky-linux/lttng-modules/2.4.1-r0/git/probes/lttng-probe-block.o' failed
| make[3]: *** [/home/pokybuild/yocto-autobuilder/yocto-slave/nightly-x86-64-lsb/build/build/tmp/work/qemux86_64-poky-linux/lttng-modules/2.4.1-r0/git/probes/lttng-probe-block.o] Error 1
| scripts/Makefile.build:455: recipe for target '/home/pokybuild/yocto-autobuilder/yocto-slave/nightly-x86-64-lsb/build/build/tmp/work/qemux86_64-poky-linux/lttng-modules/2.4.1-r0/git/probes' failed
| make[2]: *** [/home/pokybuild/yocto-autobuilder/yocto-slave/nightly-x86-64-lsb/build/build/tmp/work/qemux86_64-poky-linux/lttng-modules/2.4.1-r0/git/probes] Error 2
| Makefile:1274: recipe for target '_module_/home/pokybuild/yocto-autobuilder/yocto-slave/nightly-x86-64-lsb/build/build/tmp/work/qemux86_64-poky-linux/lttng-modules/2.4.1-r0/git' failed
| make[1]: *** [_module_/home/pokybuild/yocto-autobuilder/yocto-slave/nightly-x86-64-lsb/build/build/tmp/work/qemux86_64-poky-linux/lttng-modules/2.4.1-r0/git] Error 2
| make[1]: Leaving directory '/home/pokybuild/yocto-autobuilder/yocto-slave/nightly-x86-64-lsb/build/build/tmp/sysroots/qemux86-64/usr/src/kernel'
| Makefile:51: recipe for target 'default' failed
| make: *** [default] Error 2
| ERROR: oe_runmake failed
| WARNING: /home/pokybuild/yocto-autobuilder/yocto-slave/nightly-x86-64-lsb/build/build/tmp/work/qemux86_64-poky-linux/lttng-modules/2.4.1-r0/temp/run.do_compile.14990:1 exit 1 from
|   exit 1
| ERROR: Function failed: do_compile (log file is located at /home/pokybuild/yocto-autobuilder/yocto-slave/nightly-x86-64-lsb/build/build/tmp/work/qemux86_64-poky-linux/lttng-modules/2.4.1-r0/temp/log.do_compile.14990)
NOTE: recipe lttng-modules-2.4.1-r0: task do_compile: Failed
ERROR: Task 3885 (/home/pokybuild/yocto-autobuilder/yocto-slave/nightly-x86-64-lsb/build/meta/recipes-kernel/lttng/lttng-modules_2.4.1.bb, do_compile) failed with exit code '1'
Comment 1 Bruce Ashfield 2014-06-18 00:42:15 UTC
Richard already reported this, and I'm fixing it right now. So I'll grab this.