| Summary: |
openssl fails to build for x86_64 on i686 platform |
| Product: |
[Build System, Metadata & Runtime] OE-Core
|
Reporter: |
Yi Zhao <yi.zhao> |
| Component: |
connectivity | Assignee: |
Cristian Iorga <cristian.iorga> |
| Status: |
VERIFIED
FIXED
|
QA Contact: |
Yi Zhao <yi.zhao> |
| Severity: |
normal
|
|
|
| Priority: |
Medium+
|
CC: |
alexandru.c.georgescu, ke.zou, meta.mr.watcher, meta.watcher, richard.purdie, sgw, yi.zhao, zhangle.yang
|
| Version: |
1.8 | |
|
| Target Milestone: |
1.9 M1 | |
|
| Hardware: |
x86 | |
|
| OS: |
Multiple | |
|
| Whiteboard: |
|
|
OS type for building Yocto:
|
---
|
Type of Regression:
|
Regression (Used to work)
|
|
Verified:
|
|
Documentation change:
|
No (bug/feature does not impact docs)
|
| Attachments: |
|
Created attachment 2467 [details] log.do_complie git rev: fido/33558eacc8a2d3dce3396b9ab2fd0773ac5076bc Host: fedora21 i686 or Centos 6.6 i686 Steps: 1. Set the machine to qemux86-64 2. bitbake openssl Error message: ################## | ghash-x86_64.s: Assembler messages: | ghash-x86_64.s:890: Error: junk `.15473355479995e+19' after expression | <builtin>: recipe for target 'ghash-x86_64.o' failed | make[2]: *** [ghash-x86_64.o] Error 1 | make[2]: Leaving directory '/buildarea/poky/build/tmp/work/core2-64-poky-linux/openssl/1.0.2a-r0/openssl-1.0.2a/crypto/modes' | Makefile:88: recipe for target 'subdirs' failed | make[1]: *** [subdirs] Error 1 | make[1]: Leaving directory '/buildarea/poky/build/tmp/work/core2-64-poky-linux/openssl/1.0.2a-r0/openssl-1.0.2a/crypto' | Makefile:280: recipe for target 'build_crypto' failed | make: *** [build_crypto] Error 1 | ERROR: oe_runmake failed | WARNING: /buildarea/poky/build/tmp/work/core2-64-poky-linux/openssl/1.0.2a-r0/temp/run.do_compile.22301:1 exit 1 from | exit 1 | ERROR: Function failed: do_compile (log file is located at /buildarea/poky/build/tmp/work/core2-64-poky-linux/openssl/1.0.2a-r0/temp/log.do_compile.22301) ################### Please see the attachment for the detail log