Bug 7941

Summary: PR Service selftest failures
Product: [QA/Testing] Build Testing Reporter: Richard Purdie <richard.purdie>
Component: generalAssignee: Leonardo Sandoval Gonzalez <leonardo.sandoval.gonzalez>
Status: VERIFIED FIXED QA Contact: Daniel Istrate <daniel.alexandrux.istrate>
Severity: normal    
Priority: High CC: alexandru.c.georgescu, leonardo.sandoval.gonzalez
Version: unspecified   
Target Milestone: 1.9 M2   
Hardware: x86   
OS: Multiple   
Whiteboard:
OS type for building Yocto: --- Type of Regression: ---
Verified: Documentation change: No (bug/feature does not impact docs)
Bug Depends on:    
Bug Blocks: 8176    

Description Richard Purdie 2015-07-01 14:14:38 UTC
### Shell environment set up for builds. ###

You can now run 'bitbake <target>'

Common targets are:
    core-image-minimal
    core-image-sato
    meta-toolchain
    adt-installer
    meta-ide-support

You can also run generated qemu images with a command like 'runqemu qemux86'
2015-06-30 08:51:02,885 - selftest - INFO - Checking that everything is in order before running the tests
2015-06-30 08:51:05,327 - selftest - INFO - Running bitbake -p
2015-06-30 08:51:17,191 - selftest - INFO - Loading tests from: oeqa.selftest.bblayers
2015-06-30 08:51:17,193 - selftest - INFO - Loading tests from: oeqa.selftest.bbtests
2015-06-30 08:51:17,195 - selftest - INFO - Loading tests from: oeqa.selftest.buildhistory
2015-06-30 08:51:17,196 - selftest - INFO - Loading tests from: oeqa.selftest.buildoptions
2015-06-30 08:51:17,198 - selftest - INFO - Loading tests from: oeqa.selftest.devtool
2015-06-30 08:51:17,221 - selftest - INFO - Loading tests from: oeqa.selftest.layerappend
2015-06-30 08:51:17,222 - selftest - INFO - Loading tests from: oeqa.selftest.lic-checksum
2015-06-30 08:51:17,223 - selftest - INFO - Loading tests from: oeqa.selftest.oescripts
2015-06-30 08:51:17,224 - selftest - INFO - Loading tests from: oeqa.selftest.pkgdata
2015-06-30 08:51:17,227 - selftest - INFO - Loading tests from: oeqa.selftest.prservice
2015-06-30 08:51:17,229 - selftest - INFO - Loading tests from: oeqa.selftest.recipetool
2015-06-30 08:51:17,232 - selftest - INFO - Loading tests from: oeqa.selftest.sstate
2015-06-30 08:51:17,233 - selftest - INFO - Loading tests from: oeqa.selftest.sstatetests
2015-06-30 08:51:17,235 - selftest - INFO - Loading tests from: oeqa.selftest.wic
2015-06-30 08:51:17,237 - selftest - INFO - Adding: "include selftest.inc" in local.conf
2015-06-30 08:51:17 - test_bitbakelayers_add_remove (oeqa.selftest.bblayers.BitbakeLayers) ... ok
2015-06-30 08:51:28 - test_bitbakelayers_flatten (oeqa.selftest.bblayers.BitbakeLayers) ... ok
2015-06-30 08:51:33 - test_bitbakelayers_showappends (oeqa.selftest.bblayers.BitbakeLayers) ... ok
2015-06-30 08:51:38 - test_bitbakelayers_showcrossdepends (oeqa.selftest.bblayers.BitbakeLayers) ... ok
2015-06-30 08:52:08 - test_bitbakelayers_showlayers (oeqa.selftest.bblayers.BitbakeLayers) ... ok
2015-06-30 08:52:09 - test_bitbakelayers_showoverlayed (oeqa.selftest.bblayers.BitbakeLayers) ... ok
2015-06-30 08:52:14 - test_bitbake_g (oeqa.selftest.bbtests.BitbakeTests) ... ok
2015-06-30 08:52:23 - test_bitbake_invalid_recipe (oeqa.selftest.bbtests.BitbakeTests) ... ok
2015-06-30 08:52:24 - test_bitbake_invalid_target (oeqa.selftest.bbtests.BitbakeTests) ... ok
2015-06-30 08:52:27 - test_checkuri (oeqa.selftest.bbtests.BitbakeTests) ... ok
2015-06-30 08:52:32 - test_continue (oeqa.selftest.bbtests.BitbakeTests) ... ok
2015-06-30 08:56:27 - test_dry_run (oeqa.selftest.bbtests.BitbakeTests) ... ok
2015-06-30 08:56:32 - test_environment (oeqa.selftest.bbtests.BitbakeTests) ... ok
2015-06-30 08:56:34 - test_event_handler (oeqa.selftest.bbtests.BitbakeTests) ... ok
2015-06-30 08:56:54 - test_force_task (oeqa.selftest.bbtests.BitbakeTests) ... ok
2015-06-30 08:57:27 - test_image_manifest (oeqa.selftest.bbtests.BitbakeTests) ... ok
2015-06-30 08:57:54 - test_invalid_patch (oeqa.selftest.bbtests.BitbakeTests) ... ok
2015-06-30 08:58:13 - test_invalid_recipe_src_uri (oeqa.selftest.bbtests.BitbakeTests) ... ok
2015-06-30 08:58:31 - test_just_parse (oeqa.selftest.bbtests.BitbakeTests) ... ok
2015-06-30 08:58:35 - test_local_sstate (oeqa.selftest.bbtests.BitbakeTests) ... ok
2015-06-30 08:59:20 - test_non_gplv3 (oeqa.selftest.bbtests.BitbakeTests) ... ok
2015-06-30 09:12:35 - test_postfile (oeqa.selftest.bbtests.BitbakeTests) ... ok
2015-06-30 09:12:37 - test_prefile (oeqa.selftest.bbtests.BitbakeTests) ... ok
2015-06-30 09:12:41 - test_rename_downloaded_file (oeqa.selftest.bbtests.BitbakeTests) ... ok
2015-06-30 09:13:08 - test_run_bitbake_from_dir_1 (oeqa.selftest.bbtests.BitbakeTests) ... ok
2015-06-30 09:13:10 - test_run_bitbake_from_dir_2 (oeqa.selftest.bbtests.BitbakeTests) ... ok
2015-06-30 09:13:13 - test_version (oeqa.selftest.bbtests.BitbakeTests) ... ok
2015-06-30 09:13:19 - test_warnings_errors (oeqa.selftest.bbtests.BitbakeTests) ... ok
2015-06-30 09:13:20 - test_buildhistory_basic (oeqa.selftest.buildoptions.BuildhistoryTests) ... ok
2015-06-30 09:13:44 - test_buildhistory_buildtime_pr_backwards (oeqa.selftest.buildoptions.BuildhistoryTests) ... ok
2015-06-30 09:15:41 - test_stoptask_behavior (oeqa.selftest.buildoptions.DiskMonTest) ... ok
2015-06-30 09:16:27 - test_ccache_tool (oeqa.selftest.buildoptions.ImageOptionsTests) ... ok
2015-06-30 09:18:17 - test_incremental_image_generation (oeqa.selftest.buildoptions.ImageOptionsTests) ... ok
2015-06-30 09:23:19 - test_rm_old_image (oeqa.selftest.buildoptions.ImageOptionsTests) ... ok
2015-06-30 09:25:25 - test_options_warnqa_errorqa_switch (oeqa.selftest.buildoptions.SanityOptionsTest) ... ok
2015-06-30 09:26:08 - test_sanity_userspace_dependency (oeqa.selftest.buildoptions.SanityOptionsTest) ... ok
2015-06-30 09:30:03 - test_create_workspace (oeqa.selftest.devtool.DevtoolTests) ... ok
2015-06-30 09:30:08 - test_devtool_add (oeqa.selftest.devtool.DevtoolTests) ... ok
2015-06-30 09:30:49 - test_devtool_add_fetch (oeqa.selftest.devtool.DevtoolTests) ... ok
2015-06-30 09:31:19 - test_devtool_add_fetch_git (oeqa.selftest.devtool.DevtoolTests) ... ok
2015-06-30 09:31:42 - test_devtool_add_library (oeqa.selftest.devtool.DevtoolTests) ... ok
2015-06-30 09:36:06 - test_devtool_deploy_target (oeqa.selftest.devtool.DevtoolTests) ... ok
2015-06-30 09:39:55 - test_devtool_extract (oeqa.selftest.devtool.DevtoolTests) ... ok
2015-06-30 09:40:02 - test_devtool_modify (oeqa.selftest.devtool.DevtoolTests) ... ok
2015-06-30 09:41:32 - test_devtool_modify_git (oeqa.selftest.devtool.DevtoolTests) ... ok
2015-06-30 09:42:10 - test_devtool_modify_invalid (oeqa.selftest.devtool.DevtoolTests) ... ok
2015-06-30 09:44:12 - test_devtool_modify_localfiles (oeqa.selftest.devtool.DevtoolTests) ... ok
2015-06-30 09:46:35 - test_devtool_reset_all (oeqa.selftest.devtool.DevtoolTests) ... ok
2015-06-30 09:48:13 - test_devtool_update_recipe (oeqa.selftest.devtool.DevtoolTests) ... ok
2015-06-30 09:48:32 - test_devtool_update_recipe_append (oeqa.selftest.devtool.DevtoolTests) ... ok
2015-06-30 09:49:17 - test_devtool_update_recipe_append_git (oeqa.selftest.devtool.DevtoolTests) ... ok
2015-06-30 09:50:01 - test_devtool_update_recipe_git (oeqa.selftest.devtool.DevtoolTests) ... ok
2015-06-30 09:50:21 - test_layer_appends (oeqa.selftest.layerappend.LayerAppendTests) ... ok
2015-06-30 09:50:54 - test_nonmatching_checksum (oeqa.selftest.lic-checksum.LicenseTests) ... ok
2015-06-30 09:51:03 - test_buildhistory_diff (oeqa.selftest.oescripts.BuildhistoryDiffTests) ... ok
2015-06-30 09:52:21 - test_cleanup_workdir (oeqa.selftest.oescripts.TestScripts) ... ok
2015-06-30 09:54:14,690 - selftest - INFO - Running bitbake to generate pkgdata
2015-06-30 09:54:22 - test_find_path (oeqa.selftest.pkgdata.OePkgdataUtilTests) ... ok
2015-06-30 09:54:27 - test_glob (oeqa.selftest.pkgdata.OePkgdataUtilTests) ... ok
2015-06-30 09:54:31 - test_list_pkg_files (oeqa.selftest.pkgdata.OePkgdataUtilTests) ... ok
2015-06-30 09:54:48 - test_list_pkgs (oeqa.selftest.pkgdata.OePkgdataUtilTests) ... ok
2015-06-30 09:54:58 - test_lookup_pkg (oeqa.selftest.pkgdata.OePkgdataUtilTests) ... ok
2015-06-30 09:55:05 - test_lookup_recipe (oeqa.selftest.pkgdata.OePkgdataUtilTests) ... ok
2015-06-30 09:55:09 - test_read_value (oeqa.selftest.pkgdata.OePkgdataUtilTests) ... ok
2015-06-30 09:55:12 - test_specify_pkgdatadir (oeqa.selftest.pkgdata.OePkgdataUtilTests) ... ok
2015-06-30 09:55:14 - test_import_export_override_db (oeqa.selftest.prservice.BitbakePrTests) ... FAIL
2015-06-30 09:55:20 - test_import_export_replace_db (oeqa.selftest.prservice.BitbakePrTests) ... FAIL
2015-06-30 09:55:28 - test_pr_service_deb_arch_dep (oeqa.selftest.prservice.BitbakePrTests) ... FAIL
2015-06-30 09:55:40 - test_pr_service_deb_arch_indep (oeqa.selftest.prservice.BitbakePrTests) ... FAIL
2015-06-30 09:55:46 - test_pr_service_ipk_arch_dep (oeqa.selftest.prservice.BitbakePrTests) ... FAIL
2015-06-30 09:55:58 - test_pr_service_ipk_arch_indep (oeqa.selftest.prservice.BitbakePrTests) ... FAIL
2015-06-30 09:56:03 - test_pr_service_rpm_arch_dep (oeqa.selftest.prservice.BitbakePrTests) ... FAIL
2015-06-30 09:56:09 - test_pr_service_rpm_arch_indep (oeqa.selftest.prservice.BitbakePrTests) ... FAIL
2015-06-30 09:56:15,953 - selftest - INFO - Running bitbake to generate pkgdata
2015-06-30 09:57:03 - test_recipetool_appendfile_add (oeqa.selftest.recipetool.RecipetoolTests) ... ok
2015-06-30 09:57:30 - test_recipetool_appendfile_add_bindir (oeqa.selftest.recipetool.RecipetoolTests) ... ok
2015-06-30 09:57:47 - test_recipetool_appendfile_add_machine (oeqa.selftest.recipetool.RecipetoolTests) ... ok
2015-06-30 09:58:01 - test_recipetool_appendfile_alternatives (oeqa.selftest.recipetool.RecipetoolTests) ... ok
2015-06-30 09:58:36 - test_recipetool_appendfile_basic (oeqa.selftest.recipetool.RecipetoolTests) ... ok
2015-06-30 09:58:51 - test_recipetool_appendfile_binary (oeqa.selftest.recipetool.RecipetoolTests) ... ok
2015-06-30 09:58:56 - test_recipetool_appendfile_extlayer (oeqa.selftest.recipetool.RecipetoolTests) ... ok
2015-06-30 09:58:59 - test_recipetool_appendfile_inst_func (oeqa.selftest.recipetool.RecipetoolTests) ... ok
2015-06-30 09:59:14 - test_recipetool_appendfile_inst_glob (oeqa.selftest.recipetool.RecipetoolTests) ... ok
2015-06-30 09:59:29 - test_recipetool_appendfile_inst_todir_glob (oeqa.selftest.recipetool.RecipetoolTests) ... ok
2015-06-30 09:59:47 - test_recipetool_appendfile_invalid (oeqa.selftest.recipetool.RecipetoolTests) ... ok
2015-06-30 09:59:56 - test_recipetool_appendfile_orig (oeqa.selftest.recipetool.RecipetoolTests) ... ok
2015-06-30 10:00:09 - test_recipetool_appendfile_patch (oeqa.selftest.recipetool.RecipetoolTests) ... ok
2015-06-30 10:00:24 - test_recipetool_appendfile_postinstall (oeqa.selftest.recipetool.RecipetoolTests) ... ok
2015-06-30 10:00:41 - test_recipetool_appendfile_renamed (oeqa.selftest.recipetool.RecipetoolTests) ... ok
2015-06-30 10:00:56 - test_recipetool_appendfile_script (oeqa.selftest.recipetool.RecipetoolTests) ... ok
2015-06-30 10:01:11 - test_recipetool_appendfile_src_glob (oeqa.selftest.recipetool.RecipetoolTests) ... ok
2015-06-30 10:01:27 - test_recipetool_appendfile_subdir (oeqa.selftest.recipetool.RecipetoolTests) ... ok
2015-06-30 10:01:43 - test_recipetool_appendfile_todir (oeqa.selftest.recipetool.RecipetoolTests) ... ok
2015-06-30 10:01:58 - test_recipetool_appendfile_wildcard (oeqa.selftest.recipetool.RecipetoolTests) ... ok
2015-06-30 10:02:09 - test_recipetool_create (oeqa.selftest.recipetool.RecipetoolTests) ... ok
2015-06-30 10:02:12 - test_recipetool_create_git (oeqa.selftest.recipetool.RecipetoolTests) ... ok
2015-06-30 10:05:46 - test_cleansstate_task_distro_nonspecific (oeqa.selftest.sstatetests.SStateTests) ... ok
2015-06-30 10:07:10 - test_cleansstate_task_distro_specific (oeqa.selftest.sstatetests.SStateTests) ... ok
2015-06-30 10:09:38 - test_cleansstate_task_distro_specific_nonspecific (oeqa.selftest.sstatetests.SStateTests) ... ok
2015-06-30 10:11:46 - test_rebuild_distro_specific_sstate_cross_native_targets (oeqa.selftest.sstatetests.SStateTests) ... ok
2015-06-30 10:14:58 - test_rebuild_distro_specific_sstate_cross_target (oeqa.selftest.sstatetests.SStateTests) ... ok
2015-06-30 10:17:36 - test_rebuild_distro_specific_sstate_native_target (oeqa.selftest.sstatetests.SStateTests) ... ok
2015-06-30 10:20:24 - test_sstate_cache_management_script_using_machine (oeqa.selftest.sstatetests.SStateTests) ... ok
2015-06-30 10:33:50 - test_sstate_cache_management_script_using_pr_1 (oeqa.selftest.sstatetests.SStateTests) ... ok
2015-06-30 10:34:57 - test_sstate_cache_management_script_using_pr_2 (oeqa.selftest.sstatetests.SStateTests) ... ok
2015-06-30 10:36:52 - test_sstate_cache_management_script_using_pr_3 (oeqa.selftest.sstatetests.SStateTests) ... ok
2015-06-30 10:39:53 - test_sstate_creation_distro_nonspecific_fail (oeqa.selftest.sstatetests.SStateTests) ... ok
2015-06-30 10:40:53 - test_sstate_creation_distro_nonspecific_pass (oeqa.selftest.sstatetests.SStateTests) ... ok
2015-06-30 10:41:51 - test_sstate_creation_distro_specific_fail (oeqa.selftest.sstatetests.SStateTests) ... ok
2015-06-30 10:43:38 - test_sstate_creation_distro_specific_pass (oeqa.selftest.sstatetests.SStateTests) ... ok
2015-06-30 10:48:28 - test01_help (oeqa.selftest.wic.Wic)
Test wic --help ... ok
2015-06-30 10:48:29 - test02_createhelp (oeqa.selftest.wic.Wic)
Test wic create --help ... ok
2015-06-30 10:48:30 - test03_listhelp (oeqa.selftest.wic.Wic)
Test wic list --help ... ok
2015-06-30 10:48:31 - test04_build_image_name (oeqa.selftest.wic.Wic)
Test wic create directdisk --image-name core-image-minimal ... ok
2015-06-30 10:48:39 - test05_build_artifacts (oeqa.selftest.wic.Wic)
Test wic create directdisk providing all artifacts. ... ok
2015-06-30 10:49:11 - test06_gpt_image (oeqa.selftest.wic.Wic)
Test creation of core-image-minimal with gpt table and UUID boot ... ok
2015-06-30 10:49:21 - test07_unsupported_subcommand (oeqa.selftest.wic.Wic)
Test unsupported subcommand ... ok
2015-06-30 10:49:22 - test08_no_command (oeqa.selftest.wic.Wic)
Test wic without command ... ok
2015-06-30 10:49:22 - test09_help_kickstart (oeqa.selftest.wic.Wic)
Test wic help overview ... ok
2015-06-30 10:49:23 - test10_help_plugins (oeqa.selftest.wic.Wic)
Test wic help plugins ... ok
2015-06-30 10:49:24 - test11_help_kickstart (oeqa.selftest.wic.Wic)
Test wic help kickstart ... ok
2015-06-30 10:49:24 - test12_compress_gzip (oeqa.selftest.wic.Wic)
Test compressing an image with gzip ... ok
2015-06-30 10:49:33 - test13_compress_gzip (oeqa.selftest.wic.Wic)
Test compressing an image with bzip2 ... ok
2015-06-30 10:49:46 - test14_compress_gzip (oeqa.selftest.wic.Wic)
Test compressing an image with xz ... ok
2015-06-30 10:50:02 - test15_wrong_compressor (oeqa.selftest.wic.Wic)
Test how wic breaks if wrong compressor is provided ... ok

======================================================================
FAIL: test_import_export_override_db (oeqa.selftest.prservice.BitbakePrTests)
----------------------------------------------------------------------
Traceback (most recent call last):
  File "/home/pokybuild/yocto-autobuilder/yocto-worker/nightly-oe-selftest/build/meta/lib/oeqa/utils/decorators.py", line 102, in wrapped_f
    return func(*args)
  File "/home/pokybuild/yocto-autobuilder/yocto-worker/nightly-oe-selftest/build/meta/lib/oeqa/selftest/prservice.py", line 97, in test_import_export_override_db
    self.run_test_pr_export_import('m4', replace_current_db=False)
  File "/home/pokybuild/yocto-autobuilder/yocto-worker/nightly-oe-selftest/build/meta/lib/oeqa/selftest/prservice.py", line 69, in run_test_pr_export_import
    self.increment_package_pr(package_name)
  File "/home/pokybuild/yocto-autobuilder/yocto-worker/nightly-oe-selftest/build/meta/lib/oeqa/selftest/prservice.py", line 42, in increment_package_pr
    self.assertEqual(res.status, 0, msg=res.output)
AssertionError: 1 != 0 : ERROR: Only one copy of bitbake should be run against a build directory

======================================================================
FAIL: test_import_export_replace_db (oeqa.selftest.prservice.BitbakePrTests)
----------------------------------------------------------------------
Traceback (most recent call last):
  File "/home/pokybuild/yocto-autobuilder/yocto-worker/nightly-oe-selftest/build/meta/lib/oeqa/utils/decorators.py", line 102, in wrapped_f
    return func(*args)
  File "/home/pokybuild/yocto-autobuilder/yocto-worker/nightly-oe-selftest/build/meta/lib/oeqa/selftest/prservice.py", line 93, in test_import_export_replace_db
    self.run_test_pr_export_import('m4')
  File "/home/pokybuild/yocto-autobuilder/yocto-worker/nightly-oe-selftest/build/meta/lib/oeqa/selftest/prservice.py", line 69, in run_test_pr_export_import
    self.increment_package_pr(package_name)
  File "/home/pokybuild/yocto-autobuilder/yocto-worker/nightly-oe-selftest/build/meta/lib/oeqa/selftest/prservice.py", line 42, in increment_package_pr
    self.assertEqual(res.status, 0, msg=res.output)
AssertionError: 1 != 0 : ERROR: Only one copy of bitbake should be run against a build directory

======================================================================
FAIL: test_pr_service_deb_arch_dep (oeqa.selftest.prservice.BitbakePrTests)
----------------------------------------------------------------------
Traceback (most recent call last):
  File "/home/pokybuild/yocto-autobuilder/yocto-worker/nightly-oe-selftest/build/meta/lib/oeqa/utils/decorators.py", line 102, in wrapped_f
    return func(*args)
  File "/home/pokybuild/yocto-autobuilder/yocto-worker/nightly-oe-selftest/build/meta/lib/oeqa/selftest/prservice.py", line 105, in test_pr_service_deb_arch_dep
    self.run_test_pr_service('m4', 'deb', 'do_package')
  File "/home/pokybuild/yocto-autobuilder/yocto-worker/nightly-oe-selftest/build/meta/lib/oeqa/selftest/prservice.py", line 54, in run_test_pr_service
    self.increment_package_pr(package_name)
  File "/home/pokybuild/yocto-autobuilder/yocto-worker/nightly-oe-selftest/build/meta/lib/oeqa/selftest/prservice.py", line 42, in increment_package_pr
    self.assertEqual(res.status, 0, msg=res.output)
AssertionError: 1 != 0 : ERROR: Only one copy of bitbake should be run against a build directory

======================================================================
FAIL: test_pr_service_deb_arch_indep (oeqa.selftest.prservice.BitbakePrTests)
----------------------------------------------------------------------
Traceback (most recent call last):
  File "/home/pokybuild/yocto-autobuilder/yocto-worker/nightly-oe-selftest/build/meta/lib/oeqa/utils/decorators.py", line 102, in wrapped_f
    return func(*args)
  File "/home/pokybuild/yocto-autobuilder/yocto-worker/nightly-oe-selftest/build/meta/lib/oeqa/selftest/prservice.py", line 117, in test_pr_service_deb_arch_indep
    self.run_test_pr_service('xcursor-transparent-theme', 'deb', 'do_package')
  File "/home/pokybuild/yocto-autobuilder/yocto-worker/nightly-oe-selftest/build/meta/lib/oeqa/selftest/prservice.py", line 54, in run_test_pr_service
    self.increment_package_pr(package_name)
  File "/home/pokybuild/yocto-autobuilder/yocto-worker/nightly-oe-selftest/build/meta/lib/oeqa/selftest/prservice.py", line 42, in increment_package_pr
    self.assertEqual(res.status, 0, msg=res.output)
AssertionError: 1 != 0 : ERROR: Only one copy of bitbake should be run against a build directory

======================================================================
FAIL: test_pr_service_ipk_arch_dep (oeqa.selftest.prservice.BitbakePrTests)
----------------------------------------------------------------------
Traceback (most recent call last):
  File "/home/pokybuild/yocto-autobuilder/yocto-worker/nightly-oe-selftest/build/meta/lib/oeqa/utils/decorators.py", line 102, in wrapped_f
    return func(*args)
  File "/home/pokybuild/yocto-autobuilder/yocto-worker/nightly-oe-selftest/build/meta/lib/oeqa/selftest/prservice.py", line 109, in test_pr_service_ipk_arch_dep
    self.run_test_pr_service('m4', 'ipk', 'do_package')
  File "/home/pokybuild/yocto-autobuilder/yocto-worker/nightly-oe-selftest/build/meta/lib/oeqa/selftest/prservice.py", line 54, in run_test_pr_service
    self.increment_package_pr(package_name)
  File "/home/pokybuild/yocto-autobuilder/yocto-worker/nightly-oe-selftest/build/meta/lib/oeqa/selftest/prservice.py", line 42, in increment_package_pr
    self.assertEqual(res.status, 0, msg=res.output)
AssertionError: 1 != 0 : ERROR: Only one copy of bitbake should be run against a build directory

======================================================================
FAIL: test_pr_service_ipk_arch_indep (oeqa.selftest.prservice.BitbakePrTests)
----------------------------------------------------------------------
Traceback (most recent call last):
  File "/home/pokybuild/yocto-autobuilder/yocto-worker/nightly-oe-selftest/build/meta/lib/oeqa/utils/decorators.py", line 102, in wrapped_f
    return func(*args)
  File "/home/pokybuild/yocto-autobuilder/yocto-worker/nightly-oe-selftest/build/meta/lib/oeqa/selftest/prservice.py", line 121, in test_pr_service_ipk_arch_indep
    self.run_test_pr_service('xcursor-transparent-theme', 'ipk', 'do_package')
  File "/home/pokybuild/yocto-autobuilder/yocto-worker/nightly-oe-selftest/build/meta/lib/oeqa/selftest/prservice.py", line 54, in run_test_pr_service
    self.increment_package_pr(package_name)
  File "/home/pokybuild/yocto-autobuilder/yocto-worker/nightly-oe-selftest/build/meta/lib/oeqa/selftest/prservice.py", line 42, in increment_package_pr
    self.assertEqual(res.status, 0, msg=res.output)
AssertionError: 1 != 0 : ERROR: Only one copy of bitbake should be run against a build directory

======================================================================
FAIL: test_pr_service_rpm_arch_dep (oeqa.selftest.prservice.BitbakePrTests)
----------------------------------------------------------------------
Traceback (most recent call last):
  File "/home/pokybuild/yocto-autobuilder/yocto-worker/nightly-oe-selftest/build/meta/lib/oeqa/utils/decorators.py", line 102, in wrapped_f
    return func(*args)
  File "/home/pokybuild/yocto-autobuilder/yocto-worker/nightly-oe-selftest/build/meta/lib/oeqa/selftest/prservice.py", line 101, in test_pr_service_rpm_arch_dep
    self.run_test_pr_service('m4', 'rpm', 'do_package')
  File "/home/pokybuild/yocto-autobuilder/yocto-worker/nightly-oe-selftest/build/meta/lib/oeqa/selftest/prservice.py", line 54, in run_test_pr_service
    self.increment_package_pr(package_name)
  File "/home/pokybuild/yocto-autobuilder/yocto-worker/nightly-oe-selftest/build/meta/lib/oeqa/selftest/prservice.py", line 42, in increment_package_pr
    self.assertEqual(res.status, 0, msg=res.output)
AssertionError: 1 != 0 : ERROR: Only one copy of bitbake should be run against a build directory

======================================================================
FAIL: test_pr_service_rpm_arch_indep (oeqa.selftest.prservice.BitbakePrTests)
----------------------------------------------------------------------
Traceback (most recent call last):
  File "/home/pokybuild/yocto-autobuilder/yocto-worker/nightly-oe-selftest/build/meta/lib/oeqa/utils/decorators.py", line 102, in wrapped_f
    return func(*args)
  File "/home/pokybuild/yocto-autobuilder/yocto-worker/nightly-oe-selftest/build/meta/lib/oeqa/selftest/prservice.py", line 113, in test_pr_service_rpm_arch_indep
    self.run_test_pr_service('xcursor-transparent-theme', 'rpm', 'do_package')
  File "/home/pokybuild/yocto-autobuilder/yocto-worker/nightly-oe-selftest/build/meta/lib/oeqa/selftest/prservice.py", line 54, in run_test_pr_service
    self.increment_package_pr(package_name)
  File "/home/pokybuild/yocto-autobuilder/yocto-worker/nightly-oe-selftest/build/meta/lib/oeqa/selftest/prservice.py", line 42, in increment_package_pr
    self.assertEqual(res.status, 0, msg=res.output)
AssertionError: 1 != 0 : ERROR: Only one copy of bitbake should be run against a build directory

----------------------------------------------------------------------
Ran 123 tests in 7126.082s

FAILED (failures=8)
2015-06-30 10:50:03,319 - selftest - INFO - Finished
2015-06-30 10:50:03,320 - selftest - INFO - Removing the include from local.conf
program finished with exit code 1
elapsedTime=7143.035168
Comment 2 Richard Purdie 2015-07-02 15:01:23 UTC
Looks like this may be related to https://bugzilla.yoctoproject.org/show_bug.cgi?id=7734
Comment 3 Richard Purdie 2015-07-03 10:01:03 UTC
Happened again on the autobuilder, slightly different failure point, once it fails it stays failed it would seem:

https://autobuilder.yoctoproject.org/main/builders/nightly-oe-selftest/builds/53/steps/Running%20oe-selftest/logs/stdio
Comment 5 Daniel Istrate 2015-07-22 13:14:54 UTC
Verified on master with: 0f8d89ce66cfffccc9911d6c61470a585173b79d

[daniel@fedora-ws build]$ oe-selftest --run-tests prservice
2015-07-22 15:28:34,386 - selftest - INFO - Checking that everything is in order before running the tests
2015-07-22 15:28:35,732 - selftest - INFO - Running bitbake -p
2015-07-22 15:28:38,382 - selftest - INFO - Loading tests from: oeqa.selftest.prservice
2015-07-22 15:28:38,384 - selftest - INFO - Adding: "include selftest.inc" in local.conf
2015-07-22 15:28:38,385 - selftest - INFO - Adding: "include bblayers.inc" in bblayers.conf
2015-07-22 15:28:38 - test_import_export_override_db (oeqa.selftest.prservice.BitbakePrTests) ... ok
2015-07-22 15:34:56 - test_import_export_replace_db (oeqa.selftest.prservice.BitbakePrTests) ... ok
2015-07-22 15:38:08 - test_pr_service_deb_arch_dep (oeqa.selftest.prservice.BitbakePrTests) ... ok
2015-07-22 15:40:46 - test_pr_service_deb_arch_indep (oeqa.selftest.prservice.BitbakePrTests) ... ok
2015-07-22 15:42:46 - test_pr_service_ipk_arch_dep (oeqa.selftest.prservice.BitbakePrTests) ... ok
2015-07-22 15:45:30 - test_pr_service_ipk_arch_indep (oeqa.selftest.prservice.BitbakePrTests) ... ok
2015-07-22 15:47:12 - test_pr_service_rpm_arch_dep (oeqa.selftest.prservice.BitbakePrTests) ... ok
2015-07-22 15:49:28 - test_pr_service_rpm_arch_indep (oeqa.selftest.prservice.BitbakePrTests) ... ok

----------------------------------------------------------------------
Ran 8 tests in 1353.334s

OK
2015-07-22 15:51:11,719 - selftest - INFO - Finished
2015-07-22 15:51:11,719 - selftest - INFO - Removing the include from local.conf
2015-07-22 15:51:11,720 - selftest - INFO - Removing the include from bblayers.conf
[daniel@fedora-ws build]$