| Summary: | [morty] nightly-qa-logrotate error: task do_install | ||||||
|---|---|---|---|---|---|---|---|
| Product: | [Build System, Metadata & Runtime] OE-Core | Reporter: | David Lopez Barriba <davidx.lopez.barriba> | ||||
| Component: | core | Assignee: | Ross Burton <ross.burton> | ||||
| Status: | RESOLVED WORKSFORME | QA Contact: | |||||
| Severity: | normal | ||||||
| Priority: | Medium+ | CC: | meta.mr.watcher, meta.watcher | ||||
| Version: | 2.2.2 | ||||||
| Target Milestone: | 2.2.2 | ||||||
| Hardware: | x86 | ||||||
| OS: | Multiple | ||||||
| Whiteboard: | |||||||
| OS type for building Yocto: | --- | Type of Regression: | --- | ||||
| Verified: | Documentation change: | No (bug/feature does not impact docs) | |||||
| Attachments: |
|
||||||
The core error is: | /home/ab/autobuilder/yocto-worker/nightly-qa-logrotate/build/build/tmp/work/core2-64-poky-linux/gtk+3/3.20.9-r0/build/gtk/tmp-introspectf7nkbctw/.libs/Gtk-3.0: error while loading shared libraries: libgdk-3.so.0: cannot open shared object file: No such file or directory Does this happen reliably? (In reply to comment #1) > The core error is: > > | > /home/ab/autobuilder/yocto-worker/nightly-qa-logrotate/build/build/tmp/work/ > core2-64-poky-linux/gtk+3/3.20.9-r0/build/gtk/tmp-introspectf7nkbctw/.libs/ > Gtk-3.0: error while loading shared libraries: libgdk-3.so.0: cannot open > shared object file: No such file or directory > > Does this happen reliably? I've retested nightly-qa-logrotate four times to make sure, and all of them passed. They were tested in the following workers: opensuse422.yctb.zpn.intel.com #12 fedora24.yctb.zpn.intel.com #13 ubuntu1704.yctb.zpn.intel.com #14 ubuntu1604.yctb.zpn.intel.com #15 I don't know why it failed in the first time, so I couldn't reproduce it anymore. It appears the question is answered. I would suggest you close this works for me. Odd and mysterious. Could be a race but its going to be very rare and not easy to find. |
Created attachment 3854 [details] error-logrotate-log Branch : Morty Buildslave: centos7 Builder: nightly-qa-logrotate #10 error: recipe gtk+3-3.20.9-r0: task do_install: Failed | make[2]: *** [Gtk-3.0.gir] Error 1 | make[2]: Leaving directory '/home/ab/autobuilder/yocto-worker/nightly-qa-logrotate/build/build/tmp/work/core2-64-poky-linux/gtk+3/3.20.9-r0/build/gtk' | Makefile:7264: recipe for target 'install' failed | make[1]: *** [install] Error 2 | make[1]: Leaving directory '/home/ab/autobuilder/yocto-worker/nightly-qa-logrotate/build/build/tmp/work/core2-64-poky-linux/gtk+3/3.20.9-r0/build/gtk' | Makefile:716: recipe for target 'install-recursive' failed | make: *** [install-recursive] Error 1 | WARNING: exit code 1 from a shell command. | ERROR: oe_runmake failed | ERROR: Function failed: do_install (log file is located at /home/ab/autobuilder/yocto-worker/nightly-qa-logrotate/build/build/tmp/work/core2-64-poky-linux/gtk+3/3.20.9-r0/temp/log.do_install.29255) NOTE: recipe gtk+3-3.20.9-r0: task do_install: Failed ERROR: Task (/home/ab/autobuilder/yocto-worker/nightly-qa-logrotate/build/meta/recipes-gnome/gtk+/gtk+3_3.20.9.bb:do_install) failed with exit code '1' NOTE: Tasks Summary: Attempted 5992 tasks of which 391 didn't need to be rerun and 1 failed.