Bug 13788

Summary: zeus-nut] selftest failure PackageTests.test_gdb_hardlink
Product: [Build System, Metadata & Runtime] OE-Core Reporter: akuster <akuster808>
Component: coreAssignee: Randy MacLeod <randy.macleod>
Status: RESOLVED WORKSFORME QA Contact:
Severity: normal    
Priority: Medium+ CC: meta.mr.watcher, meta.watcher, randy.macleod, richard.purdie
Version: 3.0.2   
Target Milestone: 3.0.5   
Hardware: x86   
OS: Multiple   
URL: https://errors.yoctoproject.org/Errors/Build/98227/
Whiteboard:
OS type for building Yocto: --- Type of Regression: Regression (Used to work)
Verified: Documentation change: Don't know

Description akuster 2020-02-10 16:33:10 UTC
2020-02-09 04:30:51,871 - oe-selftest - INFO - FAIL: package.PackageTests.test_gdb_hardlink_debug (subunit.RemotedTestCase)
2020-02-09 04:30:51,871 - oe-selftest - INFO - ----------------------------------------------------------------------
2020-02-09 04:30:51,871 - oe-selftest - INFO - testtools.testresult.real._StringException: Traceback (most recent call last):
  File "/home/pokybuild/yocto-worker/oe-selftest-fedora/build/meta/lib/oeqa/selftest/cases/package.py", line 150, in test_gdb_hardlink_debug
    self.fail('GDB %s failed' % binary)
  File "/usr/lib64/python3.7/unittest/case.py", line 693, in fail
    raise self.failureException(msg)
AssertionError: GDB /usr/bin/hello1 failed
Comment 1 akuster 2020-02-10 16:33:51 UTC
re-run selftest build and it passed.

Logging just to capture info
Comment 2 Richard Purdie 2020-02-13 15:20:19 UTC
Related to https://bugzilla.yoctoproject.org/show_bug.cgi?id=13123 ?
Comment 3 Randy MacLeod 2021-02-04 16:27:42 UTC
Randy fix this!!
Comment 4 Randy MacLeod 2021-05-27 15:28:36 UTC
Not seen in more than a year. Re-open if seen again and get Randy to fix it for real this time!