2020-02-09 04:30:51,871 - oe-selftest - INFO - FAIL: package.PackageTests.test_gdb_hardlink_debug (subunit.RemotedTestCase) 2020-02-09 04:30:51,871 - oe-selftest - INFO - ---------------------------------------------------------------------- 2020-02-09 04:30:51,871 - oe-selftest - INFO - testtools.testresult.real._StringException: Traceback (most recent call last): File "/home/pokybuild/yocto-worker/oe-selftest-fedora/build/meta/lib/oeqa/selftest/cases/package.py", line 150, in test_gdb_hardlink_debug self.fail('GDB %s failed' % binary) File "/usr/lib64/python3.7/unittest/case.py", line 693, in fail raise self.failureException(msg) AssertionError: GDB /usr/bin/hello1 failed
re-run selftest build and it passed. Logging just to capture info
Related to https://bugzilla.yoctoproject.org/show_bug.cgi?id=13123 ?
Randy fix this!!
Not seen in more than a year. Re-open if seen again and get Randy to fix it for real this time!