Bug 14997

Summary: AB-INT archiver.Archiver.test_archiver_srpm_mode failure
Product: [QA/Testing] Functional (self) Testing Reporter: Alexander Kanavin <alex.kanavin>
Component: oe-selftestAssignee: Richard Purdie <richard.purdie>
Status: RESOLVED FIXED QA Contact:
Severity: normal    
Priority: Medium+ CC: alexandre.belloni, randy.macleod
Version: unspecified   
Target Milestone: 4.2 M2   
Hardware: x86   
OS: Multiple   
Whiteboard:
OS type for building Yocto: --- Type of Regression: ---
Verified: Documentation change: No (bug/feature does not impact docs)

Description Alexander Kanavin 2023-01-03 09:42:23 UTC
https://autobuilder.yoctoproject.org/typhoon/#/builders/80/builds/4563/steps/14/logs/stdio

2023-01-03 00:10:57,709 - oe-selftest - INFO - 0: 16/40 126/507 (1.67s) (0 failed) (archiver.Archiver.test_archiver_srpm_mode)
2023-01-03 00:10:57,709 - oe-selftest - INFO - testtools.testresult.real._StringException: Traceback (most recent call last):
  File "/home/pokybuild/yocto-worker/oe-selftest-debian/build/meta/lib/oeqa/selftest/cases/archiver.py", line 166, in test_archiver_srpm_mode
    bitbake('-n selftest-nopackages selftest-ed')
  File "/home/pokybuild/yocto-worker/oe-selftest-debian/build/meta/lib/oeqa/utils/commands.py", line 236, in bitbake
    return runCmd(cmd, ignore_status, timeout, output_log=output_log, **options)
  File "/home/pokybuild/yocto-worker/oe-selftest-debian/build/meta/lib/oeqa/utils/commands.py", line 214, in runCmd
    raise AssertionError("Command '%s' returned non-zero exit status %d:\n%s" % (command, result.status, exc_output))
AssertionError: Command 'bitbake  -n selftest-nopackages selftest-ed' returned non-zero exit status 134:
libgcc_s.so.1 must be installed for pthread_cancel to work
Aborted
Comment 1 Randy MacLeod 2023-01-05 15:39:25 UTC
Add libgcc to uninative and respin that?
Comment 3 Alexandre Belloni 2023-01-11 22:05:29 UTC
https://autobuilder.yoctoproject.org/typhoon/#builders/56/builds/2090/steps/14/logs/stdio
oe-selftest fedora36-ty-2
Comment 4 Alexandre Belloni 2023-01-11 22:41:10 UTC
the previous 3 are actually a different issue