https://autobuilder.yoctoproject.org/typhoon/#/builders/80/builds/4563/steps/14/logs/stdio 2023-01-03 00:10:57,709 - oe-selftest - INFO - 0: 16/40 126/507 (1.67s) (0 failed) (archiver.Archiver.test_archiver_srpm_mode) 2023-01-03 00:10:57,709 - oe-selftest - INFO - testtools.testresult.real._StringException: Traceback (most recent call last): File "/home/pokybuild/yocto-worker/oe-selftest-debian/build/meta/lib/oeqa/selftest/cases/archiver.py", line 166, in test_archiver_srpm_mode bitbake('-n selftest-nopackages selftest-ed') File "/home/pokybuild/yocto-worker/oe-selftest-debian/build/meta/lib/oeqa/utils/commands.py", line 236, in bitbake return runCmd(cmd, ignore_status, timeout, output_log=output_log, **options) File "/home/pokybuild/yocto-worker/oe-selftest-debian/build/meta/lib/oeqa/utils/commands.py", line 214, in runCmd raise AssertionError("Command '%s' returned non-zero exit status %d:\n%s" % (command, result.status, exc_output)) AssertionError: Command 'bitbake -n selftest-nopackages selftest-ed' returned non-zero exit status 134: libgcc_s.so.1 must be installed for pthread_cancel to work Aborted
Add libgcc to uninative and respin that?
https://autobuilder.yoctoproject.org/typhoon/#/builders/56/builds/2092/steps/14/logs/stdio oe-selftest debian11-ty-2 https://autobuilder.yoctoproject.org/typhoon/#/builders/127/builds/723/steps/14/logs/stdio oe-selftest-armhost ubuntu2204-arm-1
https://autobuilder.yoctoproject.org/typhoon/#builders/56/builds/2090/steps/14/logs/stdio oe-selftest fedora36-ty-2
the previous 3 are actually a different issue
https://autobuilder.yoctoproject.org/typhoon/#/builders/80/builds/4557/steps/14/logs/stdio https://autobuilder.yoctoproject.org/typhoon/#builders/80/builds/4555/steps/14/logs/stdio
https://git.yoctoproject.org/poky/commit/?id=4595a8bc621a5912285d26894de4fd4bd03a1bee