Bug 15047

Summary: AB-INT PTEST: python3 test_devnull_input failure
Product: [QA/Testing] Package Testing (ptest) Reporter: Alexandre Belloni <alexandre.belloni>
Component: ptestAssignee: Unassigned <unassigned>
Status: RESOLVED WORKSFORME QA Contact:
Severity: normal    
Priority: Medium CC: alexandre.belloni, randy.macleod, ross.burton
Version: unspecified   
Target Milestone: 4.3   
Hardware: x86   
OS: Multiple   
Whiteboard: AB-INT
OS type for building Yocto: --- Type of Regression: ---
Verified: Documentation change: No (bug/feature does not impact docs)

Description Alexandre Belloni 2023-02-28 16:36:22 UTC
'python3': ['test_devnull_input']}

======================================================================
FAIL: test_devnull_input (test.test_asyncio.test_subprocess.SubprocessThreadedWatcherTests.test_devnull_input)
----------------------------------------------------------------------
Traceback (most recent call last):
  File "/usr/lib/python3.11/test/test_asyncio/test_subprocess.py", line 392, in test_devnull_input
    self.assertEqual(output.rstrip(), b'0')
AssertionError: b'' != b'0'

----------------------------------------------------------------------
Ran 2339 tests in 172.016s

FAILED (failures=1, skipped=47)
test test_asyncio failed
Comment 2 Randy MacLeod 2023-06-15 14:57:48 UTC
Only seen once, in Jan/Feb 2023.
Re-open if seen again.