'python3': ['test_devnull_input']} ====================================================================== FAIL: test_devnull_input (test.test_asyncio.test_subprocess.SubprocessThreadedWatcherTests.test_devnull_input) ---------------------------------------------------------------------- Traceback (most recent call last): File "/usr/lib/python3.11/test/test_asyncio/test_subprocess.py", line 392, in test_devnull_input self.assertEqual(output.rstrip(), b'0') AssertionError: b'' != b'0' ---------------------------------------------------------------------- Ran 2339 tests in 172.016s FAILED (failures=1, skipped=47) test test_asyncio failed
https://autobuilder.yoctoproject.org/typhoon/#/builders/82/builds/4396/steps/12/logs/stdio
Only seen once, in Jan/Feb 2023. Re-open if seen again.