Bug 15163

Summary: AB-INT PTEST: python3 test_create_connection_local_addr_nomatch_family failure
Product: [QA/Testing] Package Testing (ptest) Reporter: Alexandre Belloni <alexandre.belloni>
Component: ptestAssignee: Unassigned <unassigned>
Status: RESOLVED FIXED QA Contact:
Severity: normal    
Priority: Medium CC: alexandre.belloni, joaomarcos.costa, randy.macleod
Version: unspecified   
Target Milestone: 5.0   
Hardware: x86   
OS: Multiple   
Whiteboard: AB-INT
OS type for building Yocto: --- Type of Regression: ---
Verified: Documentation change: No (bug/feature does not impact docs)

Description Alexandre Belloni 2023-07-18 17:28:04 UTC
https://autobuilder.yoctoproject.org/typhoon/#/builders/82/builds/5147/steps/12/logs/stdio

qemuarm64-ptest ubuntu2004-arm-1


======================================================================
FAIL: test_create_connection_local_addr_nomatch_family (test.test_asyncio.test_events.SelectEventLoopTests.test_create_connection_local_addr_nomatch_family)
----------------------------------------------------------------------
Traceback (most recent call last):
  File "/usr/lib/python3.11/test/test_asyncio/test_events.py", line 712, in test_create_connection_local_addr_nomatch_family
    with self.assertRaises(OSError):
AssertionError: OSError not raised

----------------------------------------------------------------------
Ran 2355 tests in 133.917s

FAILED (failures=1, skipped=48)
test test_asyncio failed
Comment 1 Randy MacLeod 2023-10-30 15:37:32 UTC
Build move to 5.0 -- ../Randy
Comment 2 João Marcos Costa 2024-01-17 13:28:55 UTC
https://autobuilder.yoctoproject.org/typhoon/#/builders/81/builds/5849/steps/12/logs/stdio

qemux86-64-ptest fedora38-ty-5
Comment 3 Alexandre Belloni 2024-01-25 16:30:55 UTC
Did not happen for 3 months