https://autobuilder.yoctoproject.org/typhoon/#/builders/82/builds/5147/steps/12/logs/stdio qemuarm64-ptest ubuntu2004-arm-1 ====================================================================== FAIL: test_create_connection_local_addr_nomatch_family (test.test_asyncio.test_events.SelectEventLoopTests.test_create_connection_local_addr_nomatch_family) ---------------------------------------------------------------------- Traceback (most recent call last): File "/usr/lib/python3.11/test/test_asyncio/test_events.py", line 712, in test_create_connection_local_addr_nomatch_family with self.assertRaises(OSError): AssertionError: OSError not raised ---------------------------------------------------------------------- Ran 2355 tests in 133.917s FAILED (failures=1, skipped=48) test test_asyncio failed
Build move to 5.0 -- ../Randy
https://autobuilder.yoctoproject.org/typhoon/#/builders/81/builds/5849/steps/12/logs/stdio qemux86-64-ptest fedora38-ty-5
Did not happen for 3 months