Bug 15467

Summary: AB-INT PTEST: tcl ptest failure: in http11.test
Product: [QA/Testing] Package Testing (ptest) Reporter: João Marcos Costa <joaomarcos.costa>
Component: ptestAssignee: Ross Burton <ross.burton>
Status: RESOLVED FIXED QA Contact:
Severity: normal    
Priority: Medium CC: randy.macleod, yoann.congal
Version: unspecified   
Target Milestone: 5.3   
Hardware: x86   
OS: Multiple   
Whiteboard: AB-INT
OS type for building Yocto: --- Type of Regression: ---
Verified: Documentation change: Don't know

Description João Marcos Costa 2024-04-08 08:21:33 UTC
https://autobuilder.yoctoproject.org/typhoon/#/builders/82/builds/6287/steps/12/logs/stdio

AssertionError: 
Failed ptests:
{'tcl': ['http11.test']}

qemuarm64-ptest ubuntu2004-arm-1
Comment 1 João Marcos Costa 2025-02-04 10:34:52 UTC
https://autobuilder.yoctoproject.org/valkyrie/#/builders/61/builds/806/steps/12/logs/stdio

qemuarm64-ptest ubuntu2404-vk-arm2
Comment 2 João Marcos Costa 2025-02-07 12:41:30 UTC
https://autobuilder.yoctoproject.org/valkyrie/#/builders/73/builds/641/steps/12/logs/stdio

qemux86-64-ptest debian12-vk-8
Comment 3 João Marcos Costa 2025-02-18 14:33:20 UTC
https://autobuilder.yoctoproject.org/valkyrie/#/builders/61/builds/594/steps/12/logs/stdio

qemuarm64-ptest ubuntu2404-vk-arm1
Comment 4 João Marcos Costa 2025-02-18 14:33:58 UTC
https://autobuilder.yoctoproject.org/valkyrie/#/builders/73/builds/595/steps/12/logs/stdio

qemux86-64-ptest ubuntu2204-vk-3
Comment 5 João Marcos Costa 2025-02-18 14:40:08 UTC
https://autobuilder.yoctoproject.org/valkyrie/#/builders/73/builds/613/steps/13/logs/stdio

qemux86-64-ptest opensuse155-vk-1
Comment 6 João Marcos Costa 2025-02-25 13:30:45 UTC
https://autobuilder.yoctoproject.org/valkyrie/#/builders/61/builds/1005/steps/12/logs/stdio

qemuarm64-ptest ubuntu2004-vk-arm2
Comment 7 João Marcos Costa 2025-04-08 08:14:05 UTC
https://autobuilder.yoctoproject.org/valkyrie/#/builders/61/builds/1276/steps/12/logs/stdio

qemuarm64-ptest ubuntu2204-vk-arm1
Comment 8 João Marcos Costa 2025-04-16 08:16:29 UTC
https://autobuilder.yoctoproject.org/valkyrie/#/builders/73/builds/1316/steps/12/logs/stdio

qemux86-64-ptest ubuntu2204-vk-4
Comment 9 Ross Burton 2025-04-17 14:52:46 UTC
http11.test
==== Test with ThreadLevel 0 ====
==== Test with ThreadLevel 1 ====


==== http11-2.12.1 -channel,negotiate,keepalive FAILED
==== Contents of test case:

    set tok [http::geturl http://localhost:$httpd_port/testdoc.html  -timeout 5000 -channel $chan -keepalive 1]
    http::wait $tok
    seek $chan 0
    set data [read $chan]
    list [http::status $tok] [http::code $tok] [check_crc $tok $data] [meta $tok connection] [meta $tok content-encoding] [meta $tok transfer-encoding] [m
eta $tok x-requested-encodings] [expr {[file size testdoc.html]-[file size testfile.tmp]}]

---- Result was:
eof {} {crc32 mismatch:  ne 0} {} {} {} {} 130034
---- Result should have been (exact matching):
ok {HTTP/1.1 200 OK} ok {} gzip chunked gzip,deflate 0
==== http11-2.12.1 FAILED
Comment 10 João Marcos Costa 2025-05-05 07:39:39 UTC
https://autobuilder.yoctoproject.org/valkyrie/#/builders/61/builds/1421/steps/13/logs/stdio

qemuarm64-ptest ubuntu2004-vk-arm2
Comment 11 João Marcos Costa 2025-06-02 15:11:20 UTC
https://autobuilder.yoctoproject.org/valkyrie/#/builders/73/builds/1550/steps/12/logs/stdio

qemux86-64-ptest ubuntu2204-vk-2
Comment 12 João Marcos Costa 2025-06-03 09:10:42 UTC
https://autobuilder.yoctoproject.org/valkyrie/#/builders/73/builds/1563/steps/12/logs/stdio

qemux86-64-ptest rocky9-vk-3
Comment 13 João Marcos Costa 2025-06-09 06:40:10 UTC
https://autobuilder.yoctoproject.org/valkyrie/#/builders/73/builds/1649/steps/13/logs/stdio

qemux86-64-ptest alma8-vk-2
Comment 14 João Marcos Costa 2025-06-25 08:03:17 UTC
https://autobuilder.yoctoproject.org/valkyrie/#/builders/61/builds/1754/steps/12/logs/stdio

qemuarm64-ptest ubuntu2404-vk-arm2
Comment 15 João Marcos Costa 2025-07-28 08:12:03 UTC
https://autobuilder.yoctoproject.org/valkyrie/#/builders/61/builds/1891/steps/12/logs/stdio

qemuarm64-ptest ubuntu2204-vk-arm2
Comment 16 João Marcos Costa 2025-08-19 12:43:27 UTC
https://autobuilder.yoctoproject.org/valkyrie/#/builders/61/builds/2023/steps/12/logs/stdio

qemuarm64-ptest ubuntu2204-vk-arm1
Comment 17 João Marcos Costa 2025-08-21 07:55:10 UTC
https://autobuilder.yoctoproject.org/valkyrie/#/builders/73/builds/2149/steps/12/logs/stdio

qemux86-64-ptest rocky9-vk-2
Comment 18 João Marcos Costa 2025-08-22 08:09:53 UTC
https://autobuilder.yoctoproject.org/valkyrie/#/builders/73/builds/2150/steps/12/logs/stdio

qemux86-64-ptest fedora42-vk-1
Comment 20 Ross Burton 2025-09-05 12:43:24 UTC
And sent a skip for these tests.
Comment 21 Randy MacLeod 2025-09-11 15:09:23 UTC
Ross, fixed so please report the commit and close.
Comment 22 Ross Burton 2025-09-11 15:09:47 UTC
Fixed in oe-core 8f1538518fd3a3017189b38437691ce358a2566a.