https://autobuilder.yoctoproject.org/typhoon/#/builders/82/builds/6287/steps/12/logs/stdio AssertionError: Failed ptests: {'tcl': ['http11.test']} qemuarm64-ptest ubuntu2004-arm-1
https://autobuilder.yoctoproject.org/valkyrie/#/builders/61/builds/806/steps/12/logs/stdio qemuarm64-ptest ubuntu2404-vk-arm2
https://autobuilder.yoctoproject.org/valkyrie/#/builders/73/builds/641/steps/12/logs/stdio qemux86-64-ptest debian12-vk-8
https://autobuilder.yoctoproject.org/valkyrie/#/builders/61/builds/594/steps/12/logs/stdio qemuarm64-ptest ubuntu2404-vk-arm1
https://autobuilder.yoctoproject.org/valkyrie/#/builders/73/builds/595/steps/12/logs/stdio qemux86-64-ptest ubuntu2204-vk-3
https://autobuilder.yoctoproject.org/valkyrie/#/builders/73/builds/613/steps/13/logs/stdio qemux86-64-ptest opensuse155-vk-1
https://autobuilder.yoctoproject.org/valkyrie/#/builders/61/builds/1005/steps/12/logs/stdio qemuarm64-ptest ubuntu2004-vk-arm2
https://autobuilder.yoctoproject.org/valkyrie/#/builders/61/builds/1276/steps/12/logs/stdio qemuarm64-ptest ubuntu2204-vk-arm1
https://autobuilder.yoctoproject.org/valkyrie/#/builders/73/builds/1316/steps/12/logs/stdio qemux86-64-ptest ubuntu2204-vk-4
http11.test ==== Test with ThreadLevel 0 ==== ==== Test with ThreadLevel 1 ==== ==== http11-2.12.1 -channel,negotiate,keepalive FAILED ==== Contents of test case: set tok [http::geturl http://localhost:$httpd_port/testdoc.html -timeout 5000 -channel $chan -keepalive 1] http::wait $tok seek $chan 0 set data [read $chan] list [http::status $tok] [http::code $tok] [check_crc $tok $data] [meta $tok connection] [meta $tok content-encoding] [meta $tok transfer-encoding] [m eta $tok x-requested-encodings] [expr {[file size testdoc.html]-[file size testfile.tmp]}] ---- Result was: eof {} {crc32 mismatch: ne 0} {} {} {} {} 130034 ---- Result should have been (exact matching): ok {HTTP/1.1 200 OK} ok {} gzip chunked gzip,deflate 0 ==== http11-2.12.1 FAILED
https://autobuilder.yoctoproject.org/valkyrie/#/builders/61/builds/1421/steps/13/logs/stdio qemuarm64-ptest ubuntu2004-vk-arm2
https://autobuilder.yoctoproject.org/valkyrie/#/builders/73/builds/1550/steps/12/logs/stdio qemux86-64-ptest ubuntu2204-vk-2
https://autobuilder.yoctoproject.org/valkyrie/#/builders/73/builds/1563/steps/12/logs/stdio qemux86-64-ptest rocky9-vk-3
https://autobuilder.yoctoproject.org/valkyrie/#/builders/73/builds/1649/steps/13/logs/stdio qemux86-64-ptest alma8-vk-2
https://autobuilder.yoctoproject.org/valkyrie/#/builders/61/builds/1754/steps/12/logs/stdio qemuarm64-ptest ubuntu2404-vk-arm2
https://autobuilder.yoctoproject.org/valkyrie/#/builders/61/builds/1891/steps/12/logs/stdio qemuarm64-ptest ubuntu2204-vk-arm2
https://autobuilder.yoctoproject.org/valkyrie/#/builders/61/builds/2023/steps/12/logs/stdio qemuarm64-ptest ubuntu2204-vk-arm1
https://autobuilder.yoctoproject.org/valkyrie/#/builders/73/builds/2149/steps/12/logs/stdio qemux86-64-ptest rocky9-vk-2
https://autobuilder.yoctoproject.org/valkyrie/#/builders/73/builds/2150/steps/12/logs/stdio qemux86-64-ptest fedora42-vk-1
Filed upstream at https://core.tcl-lang.org/tcl/tktview/3764f4e81f1483ab554c6d60f8483887bde28221.
And sent a skip for these tests.
Ross, fixed so please report the commit and close.
Fixed in oe-core 8f1538518fd3a3017189b38437691ce358a2566a.