| Summary: | AB-INT: toaster test failures (2) | ||
|---|---|---|---|
| Product: | [QA/Testing] Functional (self) Testing | Reporter: | Mathieu Dubois-Briand <mathieu.dubois-briand> |
| Component: | general | Assignee: | Unassigned <unassigned> |
| Status: | RESOLVED OBSOLETE | QA Contact: | |
| Severity: | normal | ||
| Priority: | Medium | CC: | david.reyna, randy.macleod |
| Version: | unspecified | ||
| Target Milestone: | 6.1 | ||
| Hardware: | x86 | ||
| OS: | Multiple | ||
| Whiteboard: | AB-INT | ||
| OS type for building Yocto: | --- | Type of Regression: | --- |
| Verified: | Documentation change: | No (bug/feature does not impact docs) | |
|
Description
Mathieu Dubois-Briand
2024-11-25 14:31:47 UTC
toaster ubuntu2204-vk-4 master completed at 2024-11-23T03:22:32Z https://valkyrie.yoctoproject.org/#/builders/88/builds/141/steps/11/logs/stdio Medium for now. There are many reasons that a a URL connection could fail with: urllib3.exceptions.ReadTimeoutError: HTTPConnectionPool(host='localhost', port=39381): Read timed out. (read timeout=120) with a timeout of 120 s, I suspect network issues but there is a bug in python3-idna which is used by urllib3 IIRC and it can cause extremely long run-time: https://nvd.nist.gov/vuln/detail/cve-2024-3651 Anyway, I just thought I'd mention it in case the more likely causes can't explain this problem. toaster ubuntu2404-vk-1 master completed at 2024-12-05T03:33:43Z E TimeoutError: timed out https://valkyrie.yoctoproject.org/#/builders/88/builds/153/steps/11/logs/stdio toaster ubuntu2404-vk-1 master completed at 2024-12-12T03:01:07Z E sqlite3.OperationalError: disk I/O error E django.db.utils.OperationalError: disk I/O error https://valkyrie.yoctoproject.org/#/builders/88/builds/160/steps/11/logs/stdio toaster ubuntu2410-vk-1 master completed at 2024-12-25T03:12:30Z selenium.common.exceptions.TimeoutException: Message: An element matching "#project-created-notification" should be visible https://valkyrie.yoctoproject.org/#/builders/88/builds/173/steps/11/logs/stdio toaster ubuntu2410-vk-1 master completed at 2025-01-08T03:13:02Z selenium.common.exceptions.ElementClickInterceptedException: Message: element click intercepted: Element <input type="checkbox" class="checkbox-mergeattr" name="mergeattr" value="mergeattr"> is not clickable at point (21, 468). Other element would receive the click: <form method="POST">...</form> https://valkyrie.yoctoproject.org/#/builders/88/builds/187/steps/11/logs/stdio toaster ubuntu2410-vk-1 master completed at 2025-01-09T03:22:22Z TimeoutError: timed out https://valkyrie.yoctoproject.org/#/builders/88/builds/188/steps/11/logs/stdio toaster ubuntu2410-vk-1 master completed at 2025-01-11T03:01:06Z E django.db.utils.OperationalError: disk I/O error E sqlite3.OperationalError: disk I/O error https://valkyrie.yoctoproject.org/#/builders/88/builds/190/steps/11/logs/stdio toaster ubuntu2404-vk-2 master completed at 2025-01-16T03:12:38Z E selenium.common.exceptions.TimeoutException: Message: An element matching "#project-created-notification" should be visible https://autobuilder.yoctoproject.org/valkyrie/#/builders/88/builds/195/steps/11/logs/stdio toaster ubuntu2404-vk-1 master completed at 2025-02-25T03:12:12Z https://autobuilder.yoctoproject.org/valkyrie/#/builders/88/builds/235/steps/11/logs/stdio toaster ubuntu2204-vk-2 master completed at 2025-03-05T10:42:57Z https://autobuilder.yoctoproject.org/valkyrie/#/builders/88/builds/244/steps/11/logs/stdio toaster ubuntu2404-vk-2 master-next completed at 2025-03-05T11:45:19Z https://autobuilder.yoctoproject.org/valkyrie/#/builders/88/builds/245/steps/11/logs/stdio toaster ubuntu2410-vk-1 master completed at 2025-03-10T03:12:59Z E selenium.common.exceptions.TimeoutException: Message: An element matching "#project-created-notification" should be visible https://autobuilder.yoctoproject.org/valkyrie/#/builders/88/builds/251/steps/11/logs/stdio toaster ubuntu2404-vk-1 master completed at 2025-03-18T03:13:39Z E selenium.common.exceptions.TimeoutException: Message: An element matching "#project-created-notification" should be visible https://autobuilder.yoctoproject.org/valkyrie/#/builders/88/builds/259/steps/11/logs/stdio toaster ubuntu2204-vk-4 master completed at 2025-03-30T03:26:29Z E TimeoutError: timed out https://autobuilder.yoctoproject.org/valkyrie/#/builders/88/builds/271/steps/11/logs/stdio Bulk move of all unassigned 5.2 medium importance bugs to 5.3. toaster ubuntu2204-vk-4 master completed at 2025-05-01T03:13:54Z E selenium.common.exceptions.TimeoutException: Message: An element matching "#project-created-notification" should be visible https://autobuilder.yoctoproject.org/valkyrie/#/builders/88/builds/303/steps/11/logs/stdio toaster ubuntu2204-vk-2 master completed at 2025-05-12T03:28:49Z TimeoutError: timed out https://autobuilder.yoctoproject.org/valkyrie/#/builders/88/builds/314/steps/11/logs/stdio toaster ubuntu2404-vk-3 master completed at 2025-05-28T03:12:33Z E selenium.common.exceptions.ElementClickInterceptedException: Message: element click intercepted: Element <a href="#" class="btn btn-primary btn-lg" id="save-changes-for-switch">...</a> is not clickable at point (89, 22). Other element would receive the click: <img class="logo" src="/static/img/logo.png" alt="Yocto logo project"> https://autobuilder.yoctoproject.org/valkyrie/#/builders/88/builds/332/steps/11/logs/stdio toaster ubuntu2404-vk-2 master completed at 2025-08-26 03:14:02+00:00 E selenium.common.exceptions.ElementClickInterceptedException: Message: element click intercepted: Element <input type="checkbox" class="checkbox-mergeattr" name="mergeattr" value="mergeattr"> is not clickable at point (21, 468). Other element would receive the click: <form method="POST">...</form> https://autobuilder.yoctoproject.org/valkyrie/#/builders/88/builds/429/steps/11/logs/stdio Lots of errors, it might be something else... toaster ubuntu2204-vk-2 master completed at 2025-09-25 03:30:07+00:00 E TimeoutError: timed out https://autobuilder.yoctoproject.org/valkyrie/#/builders/88/builds/459/steps/11/logs/stdio toaster ubuntu2404-vk-1 master completed at 2025-11-19 03:12:49+00:00 E selenium.common.exceptions.NoSuchElementException: Message: Cannot locate option with value: 7; For documentation on this error, please visit: https://www.selenium.dev/documentation/webdriver/troubleshooting/errors#nosuchelementexception https://autobuilder.yoctoproject.org/valkyrie/#/builders/88/builds/517/steps/12/logs/stdio toaster ubuntu2404-vk-1 master completed at 2025-11-28 03:12:53+00:00 E selenium.common.exceptions.ElementClickInterceptedException: Message: element click intercepted: Element <input type="checkbox" class="checkbox-mergeattr" name="mergeattr" value="mergeattr"> is not clickable at point (21, 468). Other element would receive the click: <form method="POST">...</form> https://autobuilder.yoctoproject.org/valkyrie/#/builders/88/builds/528/steps/12/logs/stdio toaster ubuntu2404-vk-3 master completed at 2026-02-10 03:14:42+00:00 E selenium.common.exceptions.TimeoutException: Message: A matching element never became be clickable https://autobuilder.yoctoproject.org/valkyrie/#/builders/88/builds/606/steps/12/logs/stdio toaster ubuntu2404-vk-1 master completed at 2026-03-27 03:06:28+00:00 E RuntimeError: Can't initialize toaster. Port 8000 occupied by python3 /srv/pokybuild/yocto-worker/toaster/build/layers/bitbake/bin/../lib/toaster/manage.py runserver --noreload localhost:8000 Maybe two instances of toaster tests running in parallel? https://autobuilder.yoctoproject.org/valkyrie/#/builders/88/builds/654/steps/12/logs/stdio toaster ubuntu2404-vk-3 master completed at 2026-03-31 03:12:49+00:00 E selenium.common.exceptions.ElementClickInterceptedException: Message: element click intercepted: Element <input type="checkbox" class="checkbox-mergeattr" name="mergeattr" value="mergeattr"> is not clickable at point (21, 468). Other element would receive the click: <form method="POST">...</form> https://autobuilder.yoctoproject.org/valkyrie/#/builders/88/builds/658/steps/12/logs/stdio toaster ubuntu2204-vk-3 master completed at 2026-04-09 03:14:28+00:00 E selenium.common.exceptions.WebDriverException: Message: tab crashed https://autobuilder.yoctoproject.org/valkyrie/#/builders/88/builds/667/steps/12/logs/stdio toaster ubuntu2204-vk-2 master completed at 2026-04-14 03:22:53+00:00 E TimeoutError: timed out https://autobuilder.yoctoproject.org/valkyrie/#/builders/88/builds/672/steps/12/logs/stdio Bulk move of 6.0 Medium bugs to 6.1. toaster ubuntu2404-vk-1 master completed at 2026-07-12 03:33:38+00:00 E TimeoutError: timed out E RuntimeError: Can't initialize toaster. Port 8000 occupied by python3 /srv/pokybuild/yocto-worker/toaster/build/layers/bitbake/bin/../lib/toas https://autobuilder.yoctoproject.org/valkyrie/#/builders/88/builds/764/steps/12/logs/stdio toaster ubuntu2204-vk-2 master completed at 2026-07-16 03:12:47+00:00 E selenium.common.exceptions.StaleElementReferenceException: Message: stale element reference: stale element not found in the current frame https://autobuilder.yoctoproject.org/valkyrie/#/builders/88/builds/768/steps/12/logs/stdio toaster ubuntu2204-vk-1 master completed at 2026-07-23 03:12:46+00:00 E selenium.common.exceptions.StaleElementReferenceException: Message: stale element reference: stale element not found in the current frame https://autobuilder.yoctoproject.org/valkyrie/#/builders/88/builds/775/steps/12/logs/stdio toaster ubuntu2510-vk-1 master completed at 2026-08-04 03:11:43+00:00 > self.assertTrue(len(rows) == 1) E AssertionError: False is not true https://autobuilder.yoctoproject.org/valkyrie/#/builders/88/builds/787/steps/14/logs/stdio toaster ubuntu2510-vk-1 master completed at 2026-08-05 03:11:43+00:00 E selenium.common.exceptions.StaleElementReferenceException: Message: stale element reference: stale element not found in the current frame https://autobuilder.yoctoproject.org/valkyrie/#/builders/88/builds/788/steps/14/logs/stdio toaster ubuntu2204-vk-1 master completed at 2026-08-15 03:12:59+00:00 E selenium.common.exceptions.TimeoutException: Message: An element matching "#change-notification" should be visible https://autobuilder.yoctoproject.org/valkyrie/#/builders/88/builds/798/steps/14/logs/stdio toaster ubuntu2404-vk-3 master completed at 2026-08-18 03:09:50+00:00 E urllib.error.HTTPError: HTTP Error 403: Forbidden E layerindexlib.LayerIndexFetchError: Unable to fetch layerindex url https://layers.openembedded.org/layerindex/api/: HTTP Error 403: Forbidden E layerindexlib.LayerIndexFetchError: Unable to fetch layerindex url https://layers.openembedded.org/layerindex/api/;branch=wrynose,HEAD,master,scarthgap: Unable to fetch layerindex url https://layers.openembedded.org/layerindex/api/: HTTP Error 403: Forbidden E selenium.common.exceptions.TimeoutException: Message: An element matching "#distrostable" should be visible E selenium.common.exceptions.TimeoutException: Message: An element matching "#layerstable tbody tr" should be visible E selenium.common.exceptions.TimeoutException: Message: An element matching "#machinestable" should be visible E selenium.common.exceptions.TimeoutException: Message: An element matching "#softwarerecipestable" should be visible E selenium.common.exceptions.TimeoutException: Message: An element matching "#imagerecipestable tbody tr" should be on the page E selenium.common.exceptions.TimeoutException: Message: An element matching "#layer-container > form > div > span > div" should be visible E selenium.common.exceptions.TimeoutException: Message: An element matching "#imagerecipestable" should be visible https://autobuilder.yoctoproject.org/valkyrie/#/builders/88/builds/801/steps/14/logs/stdio toaster ubuntu2204-vk-1 master completed at 2026-08-26 03:10:04+00:00 E KeyError: 2073009 E selenium.common.exceptions.TimeoutException: Message: An element matching "#machinestable" should be visible E selenium.common.exceptions.TimeoutException: Message: An element matching "#softwarerecipestable" should be visible E selenium.common.exceptions.TimeoutException: Message: An element matching "#imagerecipestable tbody tr" should be on the page E selenium.common.exceptions.TimeoutException: Message: An element matching "#imagerecipestable" should be visible https://autobuilder.yoctoproject.org/valkyrie/#/builders/88/builds/809/steps/14/logs/stdio There have been some toaster improvements we want to open new defects if there are additional problems. |