| Summary: |
AB-INT: test_python_fatal_loggingA: Timeout while waiting for a reply from the bitbake server |
| Product: |
[QA/Testing] Functional (self) Testing
|
Reporter: |
Mathieu Dubois-Briand <mathieu.dubois-briand> |
| Component: |
oe-selftest | Assignee: |
Unassigned <unassigned> |
| Status: |
NEW
---
|
QA Contact: |
|
| Severity: |
normal
|
|
|
| Priority: |
Medium
|
CC: |
randy.macleod, richard.purdie
|
| Version: |
unspecified | |
|
| Target Milestone: |
6.2 | |
|
| Hardware: |
x86 | |
|
| OS: |
Multiple | |
|
| Whiteboard: |
AB-INT |
|
OS type for building Yocto:
|
---
|
Type of Regression:
|
---
|
|
Verified:
|
|
Documentation change:
|
No (bug/feature does not impact docs)
|
I believe this one is different from the bitbake timeout we had in the past. 2026-09-01 01:31:32,888 - oe-selftest - INFO - ... FAIL ... 2026-09-01 01:31:32,888 - oe-selftest - INFO - 8: 13/78 91/764 (61.06s) (0 failed) (bblogging.BitBakeLogging.test_python_fatal_loggingA) 2026-09-01 01:31:32,888 - oe-selftest - INFO - testtools.testresult.real._StringException: Traceback (most recent call last): File "/srv/pokybuild/yocto-worker/oe-selftest-debian/build/layers/openembedded-core/meta/lib/oeqa/selftest/cases/bblogging.py", line 154, in test_python_fatal_loggingA self.assertIn("ERROR: Logfile of failure stored in:", result.output) ~~~~~~~~~~~~~^^^^^^^^^^^^^^^^^^^^^^^^^^^^^^^^^^^^^^^^^^^^^^^^^^^^^^^ File "/usr/lib/python3.13/unittest/case.py", line 1174, in assertIn self.fail(self._formatMessage(msg, standardMsg)) ~~~~~~~~~^^^^^^^^^^^^^^^^^^^^^^^^^^^^^^^^^^^^^^^ File "/usr/lib/python3.13/unittest/case.py", line 732, in fail raise self.failureException(msg) AssertionError: 'ERROR: Logfile of failure stored in:' not found in 'Timeout while waiting for a reply from the bitbake server (60s at 01:31:32.244941)'