Bug 16416 - AB-INT: test_python_fatal_loggingA: Timeout while waiting for a reply from the bitbake server
Summary: AB-INT: test_python_fatal_loggingA: Timeout while waiting for a reply from th...
Status: NEW
Alias: None
Product: Functional (self) Testing
Classification: QA/Testing
Component: oe-selftest (show other bugs)
Version: unspecified
Hardware: x86 Multiple
: Medium normal
Target Milestone: 6.2
Assignee: Unassigned
QA Contact:
URL:
Whiteboard: AB-INT
Depends on:
Blocks:
 
Reported: 2026-09-04 11:56 UTC by Mathieu Dubois-Briand
Modified: 2026-09-10 15:54 UTC (History)
2 users (show)

See Also:
OS type for building Yocto: ---
Type of Regression: ---
Verified:
Documentation change: No (bug/feature does not impact docs)


Attachments

Note You need to log in before you can comment on or make changes to this bug.
Description Mathieu Dubois-Briand 2026-09-04 11:56:10 UTC
I believe this one is different from the bitbake timeout we had in the past.

2026-09-01 01:31:32,888 - oe-selftest - INFO -  ... FAIL
...
2026-09-01 01:31:32,888 - oe-selftest - INFO - 8: 13/78 91/764 (61.06s) (0 failed) (bblogging.BitBakeLogging.test_python_fatal_loggingA)
2026-09-01 01:31:32,888 - oe-selftest - INFO - testtools.testresult.real._StringException: Traceback (most recent call last):
  File "/srv/pokybuild/yocto-worker/oe-selftest-debian/build/layers/openembedded-core/meta/lib/oeqa/selftest/cases/bblogging.py", line 154, in test_python_fatal_loggingA
    self.assertIn("ERROR: Logfile of failure stored in:", result.output)
    ~~~~~~~~~~~~~^^^^^^^^^^^^^^^^^^^^^^^^^^^^^^^^^^^^^^^^^^^^^^^^^^^^^^^
  File "/usr/lib/python3.13/unittest/case.py", line 1174, in assertIn
    self.fail(self._formatMessage(msg, standardMsg))
    ~~~~~~~~~^^^^^^^^^^^^^^^^^^^^^^^^^^^^^^^^^^^^^^^
  File "/usr/lib/python3.13/unittest/case.py", line 732, in fail
    raise self.failureException(msg)
AssertionError: 'ERROR: Logfile of failure stored in:' not found in 'Timeout while waiting for a reply from the bitbake server (60s at 01:31:32.244941)'
Comment 1 Mathieu Dubois-Briand 2026-09-04 12:03:27 UTC
oe-selftest-debian debian13-vk-2 master completed at 2026-09-01 02:41:15+00:00
https://autobuilder.yoctoproject.org/valkyrie/#/builders/35/builds/4724/steps/17/logs/stdio
Comment 2 Randy MacLeod 2026-09-10 14:38:35 UTC
Richard looked at the cooker logs.
60 reply missed, reply happened around 90 sec.
Comment 3 Richard Purdie 2026-09-10 15:54:25 UTC
Cooker logs saved here https://valkyrie.yocto.io/pub/shared-failure-data/debian13-vk-2-selftest/
Server did reply, just took a long time (90s).