| Summary: | gnome-desktop: do_compile failed | ||
|---|---|---|---|
| Product: | [Build System, Metadata & Runtime] Meta-yocto | Reporter: | Dexuan Cui <dexuan.cui> |
| Component: | meta-yocto | Assignee: | Dexuan Cui <dexuan.cui> |
| Status: | VERIFIED FIXED | QA Contact: | |
| Severity: | critical | ||
| Priority: | High | CC: | edwin.zhai, ke.yu, kevin.tian, poky.bs.watcher, poky.watcher, richard.purdie, sgw |
| Version: | 1.0 | ||
| Target Milestone: | 1.0 M2 | ||
| Hardware: | x86 | ||
| OS: | Multiple | ||
| Whiteboard: | |||
| OS type for building Yocto: | --- | Type of Regression: | --- |
| Verified: | Program Management | Documentation change: | --- |
I have tried on latest poky master (3a78838d4f1db75d06b5d3df042638f34cf328f5), there is no build failure. I can successfully build poky-image-sato, then "bitbake gnome-desktop". Is this log came from world build? (In reply to comment #1) > I have tried on latest poky master (3a78838d4f1db75d06b5d3df042638f34cf328f5), > there is no build failure. I can successfully build poky-image-sato, then > "bitbake gnome-desktop". > Is this log came from world build? The log is http://autobuilder.pokylinux.org:8010/builders/nightly-release/builds/146/steps/shell_70/logs/stdio Looks this issue is autobuilder-specific??? I also can't reproduce the issue locally. I noticed the bug yesterday when I checked nightly logs: there were a bundle of build failurs and gnome-desktop was a cause. A patch was made: http://git.pokylinux.org/cgit.cgi/poky-contrib/commit/?h=dcui/master&id=02e91b163925553bd14ddbc69d44620da0297f5c The fix is in master now: http://git.pokylinux.org/cgit/cgit.cgi/poky/commit/?id=e8017dc3cbfc40a03d47ed170518726075937bd3 Since the bug now only happens on autobuilder and I need to wait several hours for the nightly meta-toolchian-sdk build logs, I can only mark the bug as RESOLVED in several hours today. (In reply to comment #4) > The fix is in master now: > http://git.pokylinux.org/cgit/cgit.cgi/poky/commit/?id=e8017dc3cbfc40a03d47ed170518726075937bd3 > Since the bug now only happens on autobuilder and I need to wait several hours > for the nightly meta-toolchian-sdk build logs, I can only mark the bug as > RESOLVED in several hours today. autobuilder's poky-incremental logs show the bug is fixed: http://autobuilder.pokylinux.org:8010/builders/poky-incremental/builds/30/steps/shell_37/logs/stdio http://autobuilder.pokylinux.org:8010/builders/poky-incremental/builds/30/steps/shell_38/logs/stdio http://autobuilder.pokylinux.org:8010/builders/poky-incremental/builds/30/steps/shell_39/logs/stdio http://autobuilder.pokylinux.org:8010/builders/poky-incremental/builds/30/steps/shell_40/logs/stdio (In reply to comment #5) > (In reply to comment #4) > > The fix is in master now: > > http://git.pokylinux.org/cgit/cgit.cgi/poky/commit/?id=e8017dc3cbfc40a03d47ed170518726075937bd3 > > Since the bug now only happens on autobuilder and I need to wait several hours > > for the nightly meta-toolchian-sdk build logs, I can only mark the bug as > > RESOLVED in several hours today. > autobuilder's poky-incremental logs show the bug is fixed: > http://autobuilder.pokylinux.org:8010/builders/poky-incremental/builds/30/steps/shell_37/logs/stdio > http://autobuilder.pokylinux.org:8010/builders/poky-incremental/builds/30/steps/shell_38/logs/stdio > http://autobuilder.pokylinux.org:8010/builders/poky-incremental/builds/30/steps/shell_39/logs/stdio > http://autobuilder.pokylinux.org:8010/builders/poky-incremental/builds/30/steps/shell_40/logs/stdio VERIFY it. |
nightly logs show it failed on ppc, arm, x86-64, etc: ERROR: Task failed: ('function do_compile failed', '/srv/home/pokybuild/poky-slave/nightly-release/build/build/tmp/work/ppc603e-poky-linux/gnome-desktop-2.32.1-r0/temp/log.do_compile.29479') ERROR: Logfile of failure stored in: /srv/home/pokybuild/poky-slave/nightly-release/build/build/tmp/work/ppc603e-poky-linux/gnome-desktop-2.32.1-r0/temp/log.do_compile.29479 Log data follows: | NOTE: make -j 16 GCONF_DISABLE_MAKEFILE_SCHEMA_INSTALL=1 | ... | xsltproc -o lgpl-vi.omf --stringparam db2omf.basename lgpl --stringparam db2omf.format 'docbook' --stringparam db2omf.dtd "-//OASIS//DTD DocBook XML V4.1.2//EN" --stringparam db2omf.lang vi --stringparam db2omf.omf_dir "/usr/share/omf" --stringparam db2omf.help_dir "/usr/share/gnome/help" --stringparam db2omf.omf_in "/srv/home/pokybuild/poky-slave/nightly-release/build/build/tmp/work/ppc603e-poky-linux/gnome-desktop-2.32.1-r0/gnome-desktop-2.32.1/desktop-docs/lgpl/lgpl.omf.in" `/srv/home/pokybuild/poky-slave/nightly-release/build/build/tmp/sysroots/x86_64-linux/usr/bin/pkg-config --variable db2omf gnome-doc-utils` vi/lgpl.xml || { rm -f "lgpl-vi.omf"; exit 1; } | http://www.oasis-open.org/docbook/xml/4.1.2/dbpoolx.mod:632: parser warning : PEReference: %notation.class; not found | %local.graphics.attrib;" | ^ | ... | ^ | Entity: line 1: parser error : Content error in the external subset | %graphics.attrib; | ^ | Entity: line 4: | format () #IMPLIED | ^ | unable to parse oc/lgpl.xml | make[3]: *** [lgpl-oc.omf] Error 1 | error : Operation in progress | http://www.oasis-open.org/docbook/xml/4.1.2/docbookx.dtd:110: warning: failed to load external entity "http://www.oasis-open.org/docbook/xml/4.1.2/dbhierx.mod" | %dbhier; | ^ | Entity: line 1: | %dbhier; | ^ | make[3]: Leaving directory `/srv/home/pokybuild/poky-slave/nightly-release/build/build/tmp/work/ppc603e-poky-linux/gnome-desktop-2.32.1-r0/gnome-desktop-2.32.1/desktop-docs/lgpl' | make[2]: *** [all-recursive] Error 1 | make[2]: Leaving directory `/srv/home/pokybuild/poky-slave/nightly-release/build/build/tmp/work/ppc603e-poky-linux/gnome-desktop-2.32.1-r0/gnome-desktop-2.32.1/desktop-docs' | make[1]: *** [all-recursive] Error 1 | make[1]: Leaving directory `/srv/home/pokybuild/poky-slave/nightly-release/build/build/tmp/work/ppc603e-poky-linux/gnome-desktop-2.32.1-r0/gnome-desktop-2.32.1' | make: *** [all] Error 2 | FATAL: oe_runmake failed | ERROR: Task failed: ('function do_compile failed', '/srv/home/pokybuild/poky-slave/nightly-release/build/build/tmp/work/ppc603e-poky-linux/gnome-desktop-2.32.1-r0/temp/log.do_compile.29479'