| Summary: | gtk 2.24.20 fails at do_compile | ||||||
|---|---|---|---|---|---|---|---|
| Product: | [Build System, Metadata & Runtime] OE-Core | Reporter: | Ionut Chisanovici <ionutx.chisanovici> | ||||
| Component: | core | Assignee: | Ross Burton <ross.burton> | ||||
| Status: | RESOLVED WORKSFORME | QA Contact: | |||||
| Severity: | normal | ||||||
| Priority: | Medium | CC: | meta.mr.watcher, meta.watcher, Qi.Chen | ||||
| Version: | 1.5.2 | ||||||
| Target Milestone: | 1.5.3 | ||||||
| Hardware: | x86 | ||||||
| OS: | Multiple | ||||||
| Whiteboard: | |||||||
| OS type for building Yocto: | --- | Type of Regression: | --- | ||||
| Verified: | Documentation change: | No (bug/feature does not impact docs) | |||||
| Attachments: |
|
||||||
|
Description
Ionut Chisanovici
2014-05-06 14:08:02 UTC
Forgot to mention that this is happening on Ubuntu 13.10 Ionut C On the new commit: 6a92f7ede3be3edd58d7819aa611b0c5270756bf on Ubuntu 13.10, gtk also fails at do compile: make[2]: Entering directory `/home/autobuilder/yocto-autobuilder/yocto-slave/nightly-world/build/build/tmp/work/i586-poky-linux/gtk+/2.24.20-r0/build/demos' | /home/autobuilder/yocto-autobuilder/yocto-slave/nightly-world/build/build/tmp/sysroots/x86_64-linux/usr/bin/gdk-pixbuf-csource --raw --build-list \ | apple_red /home/autobuilder/yocto-autobuilder/yocto-slave/nightly-world/build/build/tmp/work/i586-poky-linux/gtk+/2.24.20-r0/gtk+-2.24.20/demos/apple-red.png \ | gnome_foot /home/autobuilder/yocto-autobuilder/yocto-slave/nightly-world/build/build/tmp/work/i586-poky-linux/gtk+/2.24.20-r0/gtk+-2.24.20/demos/gnome-foot.png \ | > test-inline-pixbufs.h \ | || (rm -f test-inline-pixbufs.h && false) | failed to load "/home/autobuilder/yocto-autobuilder/yocto-slave/nightly-world/build/build/tmp/work/i586-poky-linux/gtk+/2.24.20-r0/gtk+-2.24.20/demos/apple-red.png": Couldn't recognize the image file format for file '/home/autobuilder/yocto-autobuilder/yocto-slave/nightly-world/build/build/tmp/work/i586-poky-linux/gtk+/2.24.20-r0/gtk+-2.24.20/demos/apple-red.png' | make[2]: *** [test-inline-pixbufs.h] Error 1 | make[2]: Leaving directory `/home/autobuilder/yocto-autobuilder/yocto-slave/nightly-world/build/build/tmp/work/i586-poky-linux/gtk+/2.24.20-r0/build/demos' | make[1]: *** [all-recursive] Error 1 | make[1]: Leaving directory `/home/autobuilder/yocto-autobuilder/yocto-slave/nightly-world/build/build/tmp/work/i586-poky-linux/gtk+/2.24.20-r0/build' | make: *** [all] Error 2 | ERROR: oe_runmake failed | WARNING: exit code 1 from a shell command. | ERROR: Function failed: do_compile (log file is located at /home/autobuilder/yocto-autobuilder/yocto-slave/nightly-world/build/build/tmp/work/i586-poky-linux/gtk+/2.24.20-r0/temp/log.do_compile.17508) NOTE: recipe gtk+-2.24.20-r0: task do_compile: Failed ERROR: Task 741 (/home/autobuilder/yocto-autobuilder/yocto-slave/nightly-world/build/meta/recipes-gnome/gtk+/gtk+_2.24.20.bb, do_compile) failed with exit code '1' Cheers, Ionut C Until this is fixed, if this reproduces constantly then clearing the gdk-pixbuf-native sstate should work around it. I built it on ubuntu12.04 and the build succeeded. Also, Ionut rebuilt it on ubuntu13.10 and the build succeeded. I think Ross's point holds. So I close this bug as FIXED/WORKSFORME. If there's any further problem, we can reopen it. //Chen Qi |