Bug 810

Summary: [beagleboard] gst-plugins-good-0.10.26-r0: do_install failed: libhal.h: No such file
Product: [Build System, Metadata & Runtime] OE-Core Reporter: Dexuan Cui <dexuan.cui>
Component: multimediaAssignee: Paul Eggleton <bluelightning>
Status: VERIFIED FIXED QA Contact:
Severity: major    
Priority: Medium CC: dongxiao.xu, meta.mr.watcher, meta.watcher, sgw, yp.bsp.watcher, yp.watcher
Version: 1.0   
Target Milestone: 1.0 M4   
Hardware: x86   
OS: Multiple   
Whiteboard:
OS type for building Yocto: --- Type of Regression: ---
Verified: Documentation change: ---

Description Dexuan Cui 2011-03-06 06:14:20 UTC
Please see http://autobuilder.yoctoproject.org:8010/builders/nightly-external/builds/71/steps/shell_26/logs/stdio

...
| Making install in hal
| make[2]: Entering directory `/srv/home/pokybuild/poky-slave/nightly-external/build/build/tmp/work/armv7a-poky-linux-gnueabi/gst-plugins-good-0.10.26-r0/ERROR: Function 'do_install' failed (see /srv/home/pokybuild/poky-slave/nightly-external/build/build/tmp/work/armv7a-poky-linux-gnueabi/gst-plugins-good-0.10.26-r0/temp/log.do_install.30709 for further information)
| gst-plugins-good-0.10.26/ext/hal'
|   CC     libgsthalelements_la-gsthalaudiosink.lo
| cc1: warning: /srv/home/pokybuild/poky-slave/nightly-external/build/build/tmp/sysroots/beagleboard/usr/include/hal: No such file or directory
| In file included from gsthalelements.h:24:0,
|                  from gsthalaudiosink.c:46:
| ./hal.h:30:20: fatal error: libhal.h: No such file or directory
| compilation terminated.
| make[2]: *** [libgsthalelements_la-gsthalaudiosink.lo] Error 1
| make[2]: Leaving directory `/srv/home/pokybuild/poky-slave/nightly-external/build/build/tmp/work/armv7a-poky-linux-gnueabi/gst-plugins-good-0.10.26-r0/gst-plugins-good-0.10.26/ext/hal'
| make[1]: *** [install-recursive] Error 1
| make[1]: Leaving directory `/srv/home/pokybuild/poky-slave/nightly-external/build/build/tmp/work/armv7a-poky-linux-gnueabi/gst-plugins-good-0.10.26-r0/gst-plugins-good-0.10.26/ext'
| make: *** [install-recursive] Error 1
| FATAL: oe_runmake failed
NOTE: package gst-plugins-good-0.10.26-r0: task do_install: Failed
Comment 1 Saul Wold 2011-03-06 09:06:28 UTC
gst-stream is missing a depends on the hal recipe
Comment 3 Paul Eggleton 2011-03-08 17:34:28 UTC
New patch sent to oe-core to remove this dependency:

http://lists.linuxtogo.org/pipermail/openembedded-core/2011-March/000391.html