Bug 810 - [beagleboard] gst-plugins-good-0.10.26-r0: do_install failed: libhal.h: No such file
Summary: [beagleboard] gst-plugins-good-0.10.26-r0: do_install failed: libhal.h: No su...
Status: VERIFIED FIXED
Alias: None
Product: OE-Core
Classification: Build System, Metadata & Runtime
Component: multimedia (show other bugs)
Version: 1.0
Hardware: x86 Multiple
: Medium major
Target Milestone: 1.0 M4
Assignee: Paul Eggleton
QA Contact:
URL:
Whiteboard:
Depends on:
Blocks:
 
Reported: 2011-03-06 06:14 UTC by Dexuan Cui
Modified: 2011-03-15 00:11 UTC (History)
6 users (show)

See Also:
OS type for building Yocto: ---
Type of Regression: ---
Verified:
Documentation change: ---


Attachments

Note You need to log in before you can comment on or make changes to this bug.
Description Dexuan Cui 2011-03-06 06:14:20 UTC
Please see http://autobuilder.yoctoproject.org:8010/builders/nightly-external/builds/71/steps/shell_26/logs/stdio

...
| Making install in hal
| make[2]: Entering directory `/srv/home/pokybuild/poky-slave/nightly-external/build/build/tmp/work/armv7a-poky-linux-gnueabi/gst-plugins-good-0.10.26-r0/ERROR: Function 'do_install' failed (see /srv/home/pokybuild/poky-slave/nightly-external/build/build/tmp/work/armv7a-poky-linux-gnueabi/gst-plugins-good-0.10.26-r0/temp/log.do_install.30709 for further information)
| gst-plugins-good-0.10.26/ext/hal'
|   CC     libgsthalelements_la-gsthalaudiosink.lo
| cc1: warning: /srv/home/pokybuild/poky-slave/nightly-external/build/build/tmp/sysroots/beagleboard/usr/include/hal: No such file or directory
| In file included from gsthalelements.h:24:0,
|                  from gsthalaudiosink.c:46:
| ./hal.h:30:20: fatal error: libhal.h: No such file or directory
| compilation terminated.
| make[2]: *** [libgsthalelements_la-gsthalaudiosink.lo] Error 1
| make[2]: Leaving directory `/srv/home/pokybuild/poky-slave/nightly-external/build/build/tmp/work/armv7a-poky-linux-gnueabi/gst-plugins-good-0.10.26-r0/gst-plugins-good-0.10.26/ext/hal'
| make[1]: *** [install-recursive] Error 1
| make[1]: Leaving directory `/srv/home/pokybuild/poky-slave/nightly-external/build/build/tmp/work/armv7a-poky-linux-gnueabi/gst-plugins-good-0.10.26-r0/gst-plugins-good-0.10.26/ext'
| make: *** [install-recursive] Error 1
| FATAL: oe_runmake failed
NOTE: package gst-plugins-good-0.10.26-r0: task do_install: Failed
Comment 1 Saul Wold 2011-03-06 09:06:28 UTC
gst-stream is missing a depends on the hal recipe
Comment 3 Paul Eggleton 2011-03-08 17:34:28 UTC
New patch sent to oe-core to remove this dependency:

http://lists.linuxtogo.org/pipermail/openembedded-core/2011-March/000391.html