Bug 8381

Summary: connman oe-selftest tests failed - connmand not running
Product: [Build System, Metadata & Runtime] OE-Core Reporter: Paul Eggleton <bluelightning>
Component: connectivityAssignee: Cristian Iorga <cristian.iorga>
Status: VERIFIED WORKSFORME QA Contact: Alexandru Georgescu <alexandru.c.georgescu>
Severity: normal    
Priority: Medium+ CC: alexandru.c.georgescu, bogdanx.a.voiculescu, meta.mr.watcher, meta.watcher, ross.burton
Version: 2.0   
Target Milestone: 2.0   
Hardware: x86   
OS: x86   
Whiteboard:
OS type for building Yocto: --- Type of Regression: ---
Verified: Documentation change: No (bug/feature does not impact docs)

Description Paul Eggleton 2015-09-23 12:40:47 UTC
From https://autobuilder.yoctoproject.org/main/builders/nightly-ipk/builds/489/steps/Running%20Sanity%20Tests_2/logs/stdio (https://autobuilder.yoctoproject.org/main/builders/nightly-ipk/builds/489, master-next, ubuntu1204):

------------------ snip ------------------
| ======================================================================
| FAIL: test_connmand_running (oeqa.runtime.connman.ConnmanTest)
| ----------------------------------------------------------------------
| Traceback (most recent call last):
|   File "/home/pokybuild/yocto-autobuilder/yocto-worker/nightly-ipk/build/meta/lib/oeqa/utils/decorators.py", line 102, in wrapped_f
|     return func(*args)
|   File "/home/pokybuild/yocto-autobuilder/yocto-worker/nightly-ipk/build/meta/lib/oeqa/utils/decorators.py", line 90, in wrapped_f
|     return f(*args)
|   File "/home/pokybuild/yocto-autobuilder/yocto-worker/nightly-ipk/build/meta/lib/oeqa/runtime/connman.py", line 31, in test_connmand_running
|     self.fail("No connmand process running")
| AssertionError: No connmand process running
| 
| ======================================================================
| FAIL: test_only_one_connmand_in_background (oeqa.runtime.connman.ConnmanTest)
| ----------------------------------------------------------------------
| Traceback (most recent call last):
|   File "/home/pokybuild/yocto-autobuilder/yocto-worker/nightly-ipk/build/meta/lib/oeqa/utils/decorators.py", line 102, in wrapped_f
|     return func(*args)
|   File "/home/pokybuild/yocto-autobuilder/yocto-worker/nightly-ipk/build/meta/lib/oeqa/runtime/connman.py", line 45, in test_only_one_connmand_in_background
|     self.assertEqual(0, status, 'Failed to find "connmand" process running in background.')
| AssertionError: 0 != 1 : Failed to find "connmand" process running in background.
------------------ snip ------------------
Comment 1 Ross Burton 2015-10-08 20:19:24 UTC
Transient and impossible to debug without access to the rootfs, which is long gone.  Closing.
Comment 2 Alexandru Georgescu 2015-10-23 06:58:06 UTC
verified as per above comments