Bug 8381 - connman oe-selftest tests failed - connmand not running
Summary: connman oe-selftest tests failed - connmand not running
Status: VERIFIED WORKSFORME
Alias: None
Product: OE-Core
Classification: Build System, Metadata & Runtime
Component: connectivity (show other bugs)
Version: 2.0
Hardware: x86 x86
: Medium+ normal
Target Milestone: 2.0
Assignee: Cristian Iorga
QA Contact: Alexandru Georgescu
URL:
Whiteboard:
Depends on:
Blocks:
 
Reported: 2015-09-23 12:40 UTC by Paul Eggleton
Modified: 2015-10-23 12:23 UTC (History)
5 users (show)

See Also:
OS type for building Yocto: ---
Type of Regression: ---
Verified:
Documentation change: No (bug/feature does not impact docs)


Attachments

Note You need to log in before you can comment on or make changes to this bug.
Description Paul Eggleton 2015-09-23 12:40:47 UTC
From https://autobuilder.yoctoproject.org/main/builders/nightly-ipk/builds/489/steps/Running%20Sanity%20Tests_2/logs/stdio (https://autobuilder.yoctoproject.org/main/builders/nightly-ipk/builds/489, master-next, ubuntu1204):

------------------ snip ------------------
| ======================================================================
| FAIL: test_connmand_running (oeqa.runtime.connman.ConnmanTest)
| ----------------------------------------------------------------------
| Traceback (most recent call last):
|   File "/home/pokybuild/yocto-autobuilder/yocto-worker/nightly-ipk/build/meta/lib/oeqa/utils/decorators.py", line 102, in wrapped_f
|     return func(*args)
|   File "/home/pokybuild/yocto-autobuilder/yocto-worker/nightly-ipk/build/meta/lib/oeqa/utils/decorators.py", line 90, in wrapped_f
|     return f(*args)
|   File "/home/pokybuild/yocto-autobuilder/yocto-worker/nightly-ipk/build/meta/lib/oeqa/runtime/connman.py", line 31, in test_connmand_running
|     self.fail("No connmand process running")
| AssertionError: No connmand process running
| 
| ======================================================================
| FAIL: test_only_one_connmand_in_background (oeqa.runtime.connman.ConnmanTest)
| ----------------------------------------------------------------------
| Traceback (most recent call last):
|   File "/home/pokybuild/yocto-autobuilder/yocto-worker/nightly-ipk/build/meta/lib/oeqa/utils/decorators.py", line 102, in wrapped_f
|     return func(*args)
|   File "/home/pokybuild/yocto-autobuilder/yocto-worker/nightly-ipk/build/meta/lib/oeqa/runtime/connman.py", line 45, in test_only_one_connmand_in_background
|     self.assertEqual(0, status, 'Failed to find "connmand" process running in background.')
| AssertionError: 0 != 1 : Failed to find "connmand" process running in background.
------------------ snip ------------------
Comment 1 Ross Burton 2015-10-08 20:19:24 UTC
Transient and impossible to debug without access to the rootfs, which is long gone.  Closing.
Comment 2 Alexandru Georgescu 2015-10-23 06:58:06 UTC
verified as per above comments