Bug 9316

Summary: bitbake-selftest fails in nightly with master on the autobuilder
Product: [Build System, Metadata & Runtime] BitBake Reporter: Joshua Lock <joshuagloe>
Component: bitbakeAssignee: Richard Purdie <richard.purdie>
Status: RESOLVED FIXED QA Contact:
Severity: normal    
Priority: Undecided CC: poky.bs.watcher, poky.watcher
Version: 2.1   
Target Milestone: ---   
Hardware: x86   
OS: Multiple   
Whiteboard:
OS type for building Yocto: --- Type of Regression: ---
Verified: Documentation change: No (bug/feature does not impact docs)

Description Joshua Lock 2016-03-21 12:20:53 UTC
The issue is easily reproduced by invoking bitbake-selftest locally:

...............................................................................................F........................................................
======================================================================
FAIL: test_wget_latest_versionstring (bb.tests.fetch.FetchLatestVersionTest)
----------------------------------------------------------------------
Traceback (most recent call last):
  File "/home/pokybuild/yocto-autobuilder/yocto-worker/nightly/build/bitbake/lib/bb/tests/fetch.py", line 758, in test_wget_latest_versionstring
    self.assertTrue(r == -1 or r == 0, msg="Package %s, version: %s <= %s" % (k[0], v, verstring))
AssertionError: Package cups, version: 2.0.0 <= 

----------------------------------------------------------------------
Ran 152 tests in 74.659s

FAILED (failures=1)