Bug 9316 - bitbake-selftest fails in nightly with master on the autobuilder
Summary: bitbake-selftest fails in nightly with master on the autobuilder
Status: RESOLVED FIXED
Alias: None
Product: BitBake
Classification: Build System, Metadata & Runtime
Component: bitbake (show other bugs)
Version: 2.1
Hardware: x86 Multiple
: Undecided normal
Target Milestone: ---
Assignee: Richard Purdie
QA Contact:
URL:
Whiteboard:
Depends on:
Blocks:
 
Reported: 2016-03-21 12:20 UTC by Joshua Lock
Modified: 2016-03-21 12:56 UTC (History)
2 users (show)

See Also:
OS type for building Yocto: ---
Type of Regression: ---
Verified:
Documentation change: No (bug/feature does not impact docs)


Attachments

Note You need to log in before you can comment on or make changes to this bug.
Description Joshua Lock 2016-03-21 12:20:53 UTC
The issue is easily reproduced by invoking bitbake-selftest locally:

...............................................................................................F........................................................
======================================================================
FAIL: test_wget_latest_versionstring (bb.tests.fetch.FetchLatestVersionTest)
----------------------------------------------------------------------
Traceback (most recent call last):
  File "/home/pokybuild/yocto-autobuilder/yocto-worker/nightly/build/bitbake/lib/bb/tests/fetch.py", line 758, in test_wget_latest_versionstring
    self.assertTrue(r == -1 or r == 0, msg="Package %s, version: %s <= %s" % (k[0], v, verstring))
AssertionError: Package cups, version: 2.0.0 <= 

----------------------------------------------------------------------
Ran 152 tests in 74.659s

FAILED (failures=1)