Bug 11569 - [Test Case 1059] Parselogs is failing to send firmware data on corei7-64 LSB image in NUC
Summary: [Test Case 1059] Parselogs is failing to send firmware data on corei7-64 LSB ...
Status: RESOLVED WORKSFORME
Alias: None
Product: BSPs
Classification: Build System, Metadata & Runtime
Component: bsps-intel-corei7-64 (show other bugs)
Version: 2.3
Hardware: x86 Multiple
: Medium normal
Target Milestone: 2.4
Assignee: sweeaun
QA Contact:
URL:
Whiteboard:
Depends on:
Blocks:
 
Reported: 2017-05-24 00:06 UTC by David Lopez Barriba
Modified: 2017-07-18 06:23 UTC (History)
2 users (show)

See Also:
OS type for building Yocto: ---
Type of Regression: ---
Verified:
Documentation change: No (bug/feature does not impact docs)


Attachments
log (205.17 KB, application/octet-stream)
2017-05-24 00:09 UTC, David Lopez Barriba
no flags Details
do_testimage log file (28.40 KB, application/octet-stream)
2017-07-18 06:21 UTC, sweeaun
no flags Details

Note You need to log in before you can comment on or make changes to this bug.
Description David Lopez Barriba 2017-05-24 00:06:30 UTC
BUILD: 2.3 M4: rc2-meta-intel-e5aa1ac23669a45491de9ecffac491c01e70203f
ENVIRONMENT: corei7-64_lsb_NUC
STEPS TO REPRODUCE: 
 1. Download poky source and prepare the build environment 
2. Boot the lsb image in a NUC

ACTUAL OUTCOME:
Test failed on:

RESULTS - parselogs.ParseLogsTest.test_parselogs - Testcase 1059: FAILED
Traceback (most recent call last):
  File "/home/david/poky64lsb2/meta/lib/oeqa/core/decorator/__init__.py", line 32, in wrapped_f
    return func(*args, **kwargs)
  File "/home/david/poky64lsb2/meta/lib/oeqa/core/decorator/__init__.py", line 32, in wrapped_f
    return func(*args, **kwargs)
  File "/home/david/poky64lsb2/meta/lib/oeqa/runtime/cases/parselogs.py", line 359, in test_parselogs
    self.assertEqual(errcount, 0, msg=self.msg)
AssertionError: 44 != 0 : Log: /home/david/poky64lsb2/build/tmp/work/intel_corei7_64-poky-linux/core-image-lsb-sdk/1.0-r0/dmesg_output.log
-----------------------
Central error: [    6.374102] Bluetooth: hci0: Failed to send firmware data (-38)


EXPECTED OUTCOME: Testcase should be PASSED

---See the attached file
Comment 1 David Lopez Barriba 2017-05-24 00:09:13 UTC
Created attachment 3777 [details]
log
Comment 2 Saul Wold 2017-05-25 14:59:21 UTC
I believe that this was whitelisted as part of Bug #10611, please review that bug and the associated commits, might be a variation on the same error just worded differently.

I believe there is no Bluetooth on the NUC thus it would fail to send!
Comment 3 California Sullivan 2017-05-25 17:08:03 UTC
I whitelisted this, but the patch didn't make it into pyro release.

I explain what's happening here: https://git.yoctoproject.org/cgit/cgit.cgi/poky/commit/?id=0100bfa01c3d7bf0c1638737c18c31888bf14552
Comment 4 sweeaun 2017-07-18 06:21:05 UTC
Created attachment 3877 [details]
do_testimage log file

Verified the whitelist patch has been integrated into master branch.
Tested do_testimage on NUC hardware and parselogs test is passing now.
Comment 5 sweeaun 2017-07-18 06:23:24 UTC
Can not reproduce this issue.