Bug 12011 - do_testimage: FAIL: test_smart_channel_add
Summary: do_testimage: FAIL: test_smart_channel_add
Status: RESOLVED WONTFIX
Alias: None
Product: Build Testing
Classification: QA/Testing
Component: general (show other bugs)
Version: 2.2.2
Hardware: x86 Multiple
: Medium normal
Target Milestone: 2.2.3
Assignee: Armin Kuster
QA Contact:
URL:
Whiteboard:
Depends on:
Blocks:
 
Reported: 2017-08-30 16:58 UTC by Todor Minchev
Modified: 2018-01-11 16:10 UTC (History)
1 user (show)

See Also:
OS type for building Yocto: ---
Type of Regression: ---
Verified:
Documentation change: No (bug/feature does not impact docs)


Attachments

Note You need to log in before you can comment on or make changes to this bug.
Description Todor Minchev 2017-08-30 16:58:22 UTC
https://autobuilder.yoctoproject.org/main/builders/nightly-ppc-lsb/builds/1184/steps/Running%20Sanity%20Tests/logs/stdio

File "/home/pokybuild/yocto-autobuilder/yocto-worker/nightly-ppc-lsb/build/meta/lib/oeqa/runtime/smart.py", line 24, in smart
    self.assertEqual(status, expected, message)
AssertionError: 1 != 0 : smart update
Comment 1 Armin Kuster 2017-10-14 01:52:03 UTC
ppc-lsb which should be the LTSI kernel (4.9)

nightly 590 - ross/rocko d9f4b79ec76b4e798b381c9546a93b8219638ab0

https://autobuilder.yocto.io/builders/nightly-ppc-lsb/builds/525/steps/Running%20Sanity%20Tests/logs/stdio


NOTE: recipe core-image-lsb-1.0-r0: task do_testimage: Succeeded
NOTE: core-image-lsb-sdk-1.0-r0 do_testimage: Target didn't reached login boot in 1500 seconds
NOTE: core-image-lsb-sdk-1.0-r0 do_testimage: Last 25 lines of text:
starting 8 nfsd kernel threads: [   27.773471] NFSD: Using /var/lib/nfs/v4recovery as the NFSv4 state recovery directory
[   27.774542] NFSD: starting 90-second grace period (net c0ac4728)
done

starting mountd: done

Starting system log daemon...0

Starting kernel log daemon...0

Starting internet superserver: xinetd.

 * Starting Avahi mDNS/DNS-SD Daemon: avahi-daemon

Starting Telephony daemon

Starting random number generator daemon.

No makedumpfile found.

Starting Lighttpd Web Server: lighttpd.

Starting crond: OK

Starting tcf-agent: OK
NOTE: core-image-lsb-sdk-1.0-r0 do_testimage: Check full boot log: /home/pokybuild/yocto-autobuilder/yocto-worker/nightly-ppc-lsb/build/build/tmp/work/qemuppc-poky-linux/core-image-lsb-sdk/1.0-r0/testimage/qemu_boot_log.20171013143811
WARNING: core-image-lsb-sdk-1.0-r0 do_testimage: Qemu ended unexpectedly, dump data from host is in /tmp/oe-saved-tests/201710131503_qemu
NOTE: core-image-lsb-sdk-1.0-r0 do_testimage: Stopping logging thread
NOTE: core-image-lsb-sdk-1.0-r0 do_testimage: Stop event received
NOTE: core-image-lsb-sdk-1.0-r0 do_testimage: Tearing down logging thread
NOTE: core-image-lsb-sdk-1.0-r0 do_testimage: Sending SIGTERM to runqemu
ERROR: core-image-lsb-sdk-1.0-r0 do_testimage: testimage received SIGTERM, shutting down...
ERROR: core-image-lsb-sdk-1.0-r0 do_testimage: core-image-lsb-sdk - FAILED - tests were interrupted during execution
ERROR: core-image-lsb-sdk-1.0-r0 do_testimage: Function failed: do_testimage
ERROR: Logfile of failure stored in: /home/pokybuild/yocto-autobuilder/yocto-worker/nightly-ppc-lsb/build/build/tmp/work/qemuppc-poky-linux/core-image-lsb-sdk/1.0-r0/temp/log.do_testimage.49217
NOTE: recipe core-image-lsb-sdk-1.0-r0: task do_testimage: Failed
ERROR: Task (/home/pokybuild/yocto-autobuilder/yocto-worker/nightly-ppc-lsb/build/meta/recipes-extended/images/core-image-lsb-sdk.bb:do_testimage) failed with exit code '1'
NOTE: Tasks Summary: Attempted 564 tasks of which 562 didn't need to be rerun and 1 failed.
Comment 2 Armin Kuster 2017-10-14 01:52:36 UTC
(In reply to comment #1)
> ppc-lsb which should be the LTSI kernel (4.9)
> 
> nightly 590 - ross/rocko d9f4b79ec76b4e798b381c9546a93b8219638ab0
> 
> https://autobuilder.yocto.io/builders/nightly-ppc-lsb/builds/525/steps/
> Running%20Sanity%20Tests/logs/stdio
> 
> 
> NOTE: recipe core-image-lsb-1.0-r0: task do_testimage: Succeeded
> NOTE: core-image-lsb-sdk-1.0-r0 do_testimage: Target didn't reached login
> boot in 1500 seconds
> NOTE: core-image-lsb-sdk-1.0-r0 do_testimage: Last 25 lines of text:
> starting 8 nfsd kernel threads: [   27.773471] NFSD: Using
> /var/lib/nfs/v4recovery as the NFSv4 state recovery directory
> [   27.774542] NFSD: starting 90-second grace period (net c0ac4728)
> done
> 
> starting mountd: done
> 
> Starting system log daemon...0
> 
> Starting kernel log daemon...0
> 
> Starting internet superserver: xinetd.
> 
>  * Starting Avahi mDNS/DNS-SD Daemon: avahi-daemon
> 
> Starting Telephony daemon
> 
> Starting random number generator daemon.
> 
> No makedumpfile found.
> 
> Starting Lighttpd Web Server: lighttpd.
> 
> Starting crond: OK
> 
> Starting tcf-agent: OK
> NOTE: core-image-lsb-sdk-1.0-r0 do_testimage: Check full boot log:
> /home/pokybuild/yocto-autobuilder/yocto-worker/nightly-ppc-lsb/build/build/
> tmp/work/qemuppc-poky-linux/core-image-lsb-sdk/1.0-r0/testimage/
> qemu_boot_log.20171013143811
> WARNING: core-image-lsb-sdk-1.0-r0 do_testimage: Qemu ended unexpectedly,
> dump data from host is in /tmp/oe-saved-tests/201710131503_qemu
> NOTE: core-image-lsb-sdk-1.0-r0 do_testimage: Stopping logging thread
> NOTE: core-image-lsb-sdk-1.0-r0 do_testimage: Stop event received
> NOTE: core-image-lsb-sdk-1.0-r0 do_testimage: Tearing down logging thread
> NOTE: core-image-lsb-sdk-1.0-r0 do_testimage: Sending SIGTERM to runqemu
> ERROR: core-image-lsb-sdk-1.0-r0 do_testimage: testimage received SIGTERM,
> shutting down...
> ERROR: core-image-lsb-sdk-1.0-r0 do_testimage: core-image-lsb-sdk - FAILED -
> tests were interrupted during execution
> ERROR: core-image-lsb-sdk-1.0-r0 do_testimage: Function failed: do_testimage
> ERROR: Logfile of failure stored in:
> /home/pokybuild/yocto-autobuilder/yocto-worker/nightly-ppc-lsb/build/build/
> tmp/work/qemuppc-poky-linux/core-image-lsb-sdk/1.0-r0/temp/log.do_testimage.
> 49217
> NOTE: recipe core-image-lsb-sdk-1.0-r0: task do_testimage: Failed
> ERROR: Task
> (/home/pokybuild/yocto-autobuilder/yocto-worker/nightly-ppc-lsb/build/meta/
> recipes-extended/images/core-image-lsb-sdk.bb:do_testimage) failed with exit
> code '1'
> NOTE: Tasks Summary: Attempted 564 tasks of which 562 didn't need to be
> rerun and 1 failed.

wrong bug #
Comment 3 Armin Kuster 2018-01-11 15:56:56 UTC
have not seen this in latest build runs
Comment 4 Richard Purdie 2018-01-11 16:10:33 UTC
We've switched away from smart so we're unlikely to spend time investigating this kind of issue any further.