Bug 12935 - [master-next] nightly-musl-x86-64 FAIL: test_kernel_module
Summary: [master-next] nightly-musl-x86-64 FAIL: test_kernel_module
Status: RESOLVED OBSOLETE
Alias: None
Product: OE-Core
Classification: Build System, Metadata & Runtime
Component: core (show other bugs)
Version: 2.6
Hardware: x86 Multiple
: Undecided normal
Target Milestone: ---
Assignee: Bruce Ashfield
QA Contact:
URL: https://autobuilder.yoctoproject.org/...
Whiteboard:
Depends on:
Blocks:
 
Reported: 2018-09-27 02:30 UTC by Armin Kuster
Modified: 2018-09-27 14:45 UTC (History)
3 users (show)

See Also:
OS type for building Yocto: ---
Type of Regression: ---
Verified:
Documentation change: Don't know


Attachments

Note You need to log in before you can comment on or make changes to this bug.
Description Armin Kuster 2018-09-27 02:30:52 UTC
| NOTE: ======================================================================
| NOTE: FAIL: test_kernel_module (kernelmodule.KernelModuleTest)
| NOTE: ----------------------------------------------------------------------
| NOTE: Traceback (most recent call last):
|   File "/home/pokybuild/yocto-worker/nightly-musl-x86-64/build/meta/lib/oeqa/core/decorator/__init__.py", line 32, in wrapped_f
|     return func(*args, **kwargs)
|   File "/home/pokybuild/yocto-worker/nightly-musl-x86-64/build/meta/lib/oeqa/core/decorator/__init__.py", line 32, in wrapped_f
|     return func(*args, **kwargs)
|   File "/home/pokybuild/yocto-worker/nightly-musl-x86-64/build/meta/lib/oeqa/core/decorator/__init__.py", line 32, in wrapped_f
|     return func(*args, **kwargs)
|   File "/home/pokybuild/yocto-worker/nightly-musl-x86-64/build/meta/lib/oeqa/runtime/cases/kernelmodule.py", line 40, in test_kernel_module
|     self.assertEqual(status, 0, msg='\n'.join([cmd, output]))
| AssertionError: 2 != 0 : cd /usr/src/kernel && make scripts prepare


<snipped>

|   HOSTLD  arch/x86/tools/relocs
|   DESCEND  objtool
| make[4]: *** No rule to make target '/lib/modules/4.18.9-yocto-standard/build/tools/objtool/fixdep.o', needed by '/lib/modules/4.18.9-yocto-standard/build/tools/objtool/fixdep-in.o'.  Stop.
| make[3]: *** [Makefile:43: /lib/modules/4.18.9-yocto-standard/build/tools/objtool/fixdep-in.o] Error 2
| make[2]: *** [/lib/modules/4.18.9-yocto-standard/build/tools/build/Makefile.include:4: fixdep] Error 2
| make[1]: *** [Makefile:63: objtool] Error 2
| make: *** [Makefile:1631: tools/objtool] Error 2
Comment 1 Bruce Ashfield 2018-09-27 13:09:04 UTC
So this only triggers with master-next ? Did someone modify devsrc ? If so, I'd recommend a revert versus a fix at this point.

I'll see if I can reproduce the problem here.
Comment 2 Richard Purdie 2018-09-27 14:45:26 UTC
This patch was being tested in -next and breaks things so was dropped.