Bug 13227 - ross/mut] python-2.7.15-r1 do_patch
Summary: ross/mut] python-2.7.15-r1 do_patch
Status: RESOLVED FIXED
Alias: None
Product: OE-Core
Classification: Build System, Metadata & Runtime
Component: core (show other bugs)
Version: 5.99
Hardware: x86 Multiple
: Undecided normal
Target Milestone: ---
Assignee: Ross Burton
QA Contact:
URL: https://errors.yoctoproject.org/Error...
Whiteboard:
Depends on:
Blocks:
 
Reported: 2019-03-18 02:34 UTC by Armin Kuster
Modified: 2019-03-18 10:46 UTC (History)
2 users (show)

See Also:
OS type for building Yocto: ---
Type of Regression: ---
Verified:
Documentation change: Don't know


Attachments

Note You need to log in before you can comment on or make changes to this bug.
Description Armin Kuster 2019-03-18 02:34:17 UTC
ERROR: Command Error: 'quilt --quiltrc TOPDIR/tmp/work/i586-poky-linux/python/2.7.15-r1/recipe-sysroot-native/etc/quiltrc push' exited with 0  Output:
Applying patch CVE-2018-14647.patch
patching file Include/pyexpat.h
Hunk #1 FAILED at 3.
Hunk #2 FAILED at 43.
2 out of 2 hunks FAILED -- rejects in file Include/pyexpat.h
The next patch would create the file Misc/NEWS.d/next/Security/2018-09-10-16-05-39.bpo-34623.Ua9jMv.rst,
which already exists!  Applying it anyway.
patching file Misc/NEWS.d/next/Security/2018-09-10-16-05-39.bpo-34623.Ua9jMv.rst
Hunk #1 FAILED at 1.
1 out of 1 hunk FAILED -- rejects in file Misc/NEWS.d/next/Security/2018-09-10-16-05-39.bpo-34623.Ua9jMv.rst
patching file Modules/_elementtree.c
Hunk #1 succeeded at 2579 with fuzz 2 (offset 5 lines).
patching file Modules/pyexpat.c
Hunk #1 FAILED at 2042.
1 out of 1 hunk FAILED -- rejects in file Modules/pyexpat.c
Patch CVE-2018-14647.patch can be reverse-applied
Comment 2 Ross Burton 2019-03-18 10:46:56 UTC
Fixed in mut