Bug 1373 - bluez-hcidump compiling fails
Summary: bluez-hcidump compiling fails
Status: RESOLVED DUPLICATE of bug 1371
Alias: None
Product: OE-Core
Classification: Build System, Metadata & Runtime
Component: connectivity (show other bugs)
Version: unspecified
Hardware: x86 Multiple
: Medium critical
Target Milestone: 1.1 M4
Assignee: Dongxiao Xu
QA Contact:
URL:
Whiteboard:
Depends on:
Blocks:
 
Reported: 2011-08-16 01:21 UTC by Tong Lin
Modified: 2011-08-18 21:55 UTC (History)
6 users (show)

See Also:
OS type for building Yocto: ---
Type of Regression: ---
Verified:
Documentation change: ---


Attachments

Note You need to log in before you can comment on or make changes to this bug.
Description Tong Lin 2011-08-16 01:21:09 UTC
when I use command: bitbake core-image-sato-sdk, the building fails. It shows that bluez-hcidump's compile step fails as following:


| make[1]: *** [src/hcidump.o] Error 1
| make[1]: *** Waiting for unfinished jobs....
| make: *** [all] Error 2
| ERROR: oe_runmake failed
| ERROR: Function 'do_compile' failed (see

and the log messages are as following:

src/hcidump.c:54:24: error: redefinition of 'ntoh64' 
/distro/tlin100/adt-test/poky/build/tmp/sysroots/qemux86/usr/include/bluetooth/bluetooth.h:185:24:
note: previous definition of 'ntoh64' was here 
make[1]: *** [src/hcidump.o] Error 1 
make[1]: *** Waiting for unfinished jobs.... 
make: *** [all] Error 2 
ERROR: oe_runmake failed 
ERROR: Function 'do_compile' failed (see
/distro/tlin100/adt-test/poky/build/tmp/work/i586-poky-linux/bluez-hcidump-2.0-r0/temp/log.do_compile.13267
for further information)

the commit# is a21ff559e7c93e9da61104f4a33e42e6004189fd
Comment 1 Dongxiao Xu 2011-08-16 20:08:54 UTC
This is a duplication of bug 1371. Please refer to that one.

Thanks,
Dongxiao

*** This bug has been marked as a duplicate of bug 1371 ***