Bug 1404 - x32: libzypp compilation fails
Summary: x32: libzypp compilation fails
Status: RESOLVED WORKSFORME
Alias: None
Product: OE-Core
Classification: Build System, Metadata & Runtime
Component: core (show other bugs)
Version: unspecified
Hardware: x86 x86_64
: Medium normal
Target Milestone: 1.2
Assignee: Nitin Kamble
QA Contact:
URL:
Whiteboard:
Depends on:
Blocks: 1579
  Show dependency tree
 
Reported: 2011-08-25 14:20 UTC by Nitin Kamble
Modified: 2011-12-01 12:25 UTC (History)
3 users (show)

See Also:
OS type for building Yocto: ---
Type of Regression: ---
Verified:
Documentation change: ---


Attachments

Note You need to log in before you can comment on or make changes to this bug.
Description Nitin Kamble 2011-08-25 14:20:06 UTC
ERROR: Logfile of failure stored in: /disk0/pokybuild/build-multilib-x32-qemu/tmp/work/qemux86_64-poky-linux-gnux32/libzypp-0.0-git1+15b6c52260bbc52b3d8e585e271b67e10cc7c433-r13/temp/log.do_compile.7326
Log data follows:
| DEBUG: SITE files ['endian-little', 'common-linux', 'common-glibc', 'bit-32', 'ix86-common', 'x86_64-linux-gnux32', 'common']
| NOTE: make -j 16
| /disk0/pokybuild/build-multilib-x32-qemu/tmp/sysroots/x86_64-linux/usr/bin/cmake -H/disk0/pokybuild/build-multilib-x32-qemu/tmp/work/qemux86_64-poky-linux-gnux32/libzypp-0.0-git1+15b6c52260bbc52b3d8e585e271b67e10cc7c433-r13/git -B/disk0/pokybuild/build-multilib-x32-qemu/tmp/work/qemux86_64-poky-linux-gnux32/libzypp-0.0-git1+15b6c52260bbc52b3d8e585e271b67e10cc7c433-r13/git --check-build-system CMakeFiles/Makefile.cmake 0
| /disk0/pokybuild/build-multilib-x32-qemu/tmp/sysroots/x86_64-linux/usr/bin/cmake -E cmake_progress_start /disk0/pokybuild/build-multilib-x32-qemu/tmp/work/qemux86_64-poky-linux-gnux32/libzypp-0.0-git1+15b6c52260bbc52b3d8e585e271b67e10cc7c433-r13/git/CMakeFiles /disk0/pokybuild/build-multilib-x32-qemu/tmp/work/qemux86_64-poky-linux-gnux32/libzypp-0.0-git1+15b6c52260bbc52b3d8e585e271b67e10cc7c433-r13/git/CMakeFiles/progress.marks
| make -f CMakeFiles/Makefile2 all
| make[1]: Entering directory `/disk0/pokybuild/build-multilib-x32-qemu/tmp/work/qemux86_64-poky-linux-gnux32/libzypp-0.0-git1+15b6c52260bbc52b3d8e585e271b67e10cc7c433-r13/git'
| make -f zypp/CMakeFiles/zypp.dir/build.make zypp/CMakeFiles/zypp.dir/depend
| make -f vendor/mongoose/CMakeFiles/mongoose.dir/build.make vendor/mongoose/CMakeFiles/mongoose.dir/depend
| make[2]: Entering directory `/disk0/pokybuild/build-multilib-x32-qemu/tmp/work/qemux86_64-poky-linux-gnux32/libzypp-0.0-git1+15b6c52260bbc52b3d8e585e271b67e10cc7c433-r13/git'
| cd /disk0/pokybuild/build-multilib-x32-qemu/tmp/work/qemux86_64-poky-linux-gnux32/libzypp-0.0-git1+15b6c52260bbc52b3d8e585e271b67e10cc7c433-r13/git && /disk0/pokybuild/build-multilib-x32-qemu/tmp/sysroots/x86_64-linux/usr/bin/cmake -E cmake_depends "Unix Makefiles" /disk0/pokybuild/build-multilib-x32-qemu/tmp/work/qemux86_64-poky-linux-gnux32/libzypp-0.0-git1+15b6c52260bbc52b3d8e585e271b67e10cc7c433-r13/git /disk0/pokybuild/build-multilib-x32-qemu/tmp/work/qemux86_64-poky-linux-gnux32/libzypp-0.0-git1+15b6c52260bbc52b3d8e585e271b67e10cc7c433-r13/git/vendor/mongoose /disk0/pokybuild/build-multilib-x32-qemu/tmp/work/qemux86_64-poky-linux-gnux32/libzypp-0.0-git1+15b6c52260bbc52b3d8e585e271b67e10cc7c433-r13/git /disk0/pokybuild/build-multilib-x32-qemu/tmp/work/qemux86_64-poky-linux-gnux32/libzypp-0.0-git1+15b6c52260bbc52b3d8e585e271b67e10cc7c433-r13/git/vendor/mongoose /disk0/pokybuild/build-multilib-x32-qemu/tmp/work/qemux86_64-poky-linux-gnux32/libzypp-0.0-git1+15b6c52260bbc52b3d8e585e271b67e10cc7c433-r13/git/vendor/mongoose/CMakeFiles/mongoose.dir/DependInfo.cmake --color=
| make[2]: Leaving directory `/disk0/pokybuild/build-multilib-x32-qemu/tmp/work/qemux86_64-poky-linux-gnux32/libzypp-0.0-git1+15b6c52260bbc52b3d8e585e271b67e10cc7c433-r13/git'
| make -f vendor/mongoose/CMakeFiles/mongoose.dir/build.make vendor/mongoose/CMakeFiles/mongoose.dir/build
| make[2]: Entering directory `/disk0/pokybuild/build-multilib-x32-qemu/tmp/work/qemux86_64-poky-linux-gnux32/libzypp-0.0-git1+15b6c52260bbc52b3d8e585e271b67e10cc7c433-r13/git'
| make[2]: Nothing to be done for `vendor/mongoose/CMakeFiles/mongoose.dir/build'.
| make[2]: Leaving directory `/disk0/pokybuild/build-multilib-x32-qemu/tmp/work/qemux86_64-poky-linux-gnux32/libzypp-0.0-git1+15b6c52260bbc52b3d8e585e271b67e10cc7c433-r13/git'
| /disk0/pokybuild/build-multilib-x32-qemu/tmp/sysroots/x86_64-linux/usr/bin/cmake -E cmake_progress_report /disk0/pokybuild/build-multilib-x32-qemu/tmp/work/qemux86_64-poky-linux-gnux32/libzypp-0.0-git1+15b6c52260bbc52b3d8e585e271b67e10cc7c433-r13/git/CMakeFiles
| [  0%] Built target mongoose
| make[2]: Entering directory `/disk0/pokybuild/build-multilib-x32-qemu/tmp/work/qemux86_64-poky-linux-gnux32/libzypp-0.0-git1+15b6c52260bbc52b3d8e585e271b67e10cc7c433-r13/git'
| cd /disk0/pokybuild/build-multilib-x32-qemu/tmp/work/qemux86_64-poky-linux-gnux32/libzypp-0.0-git1+15b6c52260bbc52b3d8e585e271b67e10cc7c433-r13/git && /disk0/pokybuild/build-multilib-x32-qemu/tmp/sysroots/x86_64-linux/usr/bin/cmake -E cmake_depends "Unix Makefiles" /disk0/pokybuild/build-multilib-x32-qemu/tmp/work/qemux86_64-poky-linux-gnux32/libzypp-0.0-git1+15b6c52260bbc52b3d8e585e271b67e10cc7c433-r13/git /disk0/pokybuild/build-multilib-x32-qemu/tmp/work/qemux86_64-poky-linux-gnux32/libzypp-0.0-git1+15b6c52260bbc52b3d8e585e271b67e10cc7c433-r13/git/zypp /disk0/pokybuild/build-multilib-x32-qemu/tmp/work/qemux86_64-poky-linux-gnux32/libzypp-0.0-git1+15b6c52260bbc52b3d8e585e271b67e10cc7c433-r13/git /disk0/pokybuild/build-multilib-x32-qemu/tmp/work/qemux86_64-poky-linux-gnux32/libzypp-0.0-git1+15b6c52260bbc52b3d8e585e271b67e10cc7c433-r13/git/zypp /disk0/pokybuild/build-multilib-x32-qemu/tmp/work/qemux86_64-poky-linux-gnux32/libzypp-0.0-git1+15b6c52260bbc52b3d8e585e271b67e10cc7c433-r13/git/zypp/CMakeFiles/zypp.dir/DependInfo.cmake --color=
| make[2]: Leaving directory `/disk0/pokybuild/build-multilib-x32-qemu/tmp/work/qemux86_64-poky-linux-gnux32/libzypp-0.0-git1+15b6c52260bbc52b3d8e585e271b67e10cc7c433-r13/git'
| make -f zypp/CMakeFiles/zypp.dir/build.make zypp/CMakeFiles/zypp.dir/build
| make[2]: Entering directory `/disk0/pokybuild/build-multilib-x32-qemu/tmp/work/qemux86_64-poky-linux-gnux32/libzypp-0.0-git1+15b6c52260bbc52b3d8e585e271b67e10cc7c433-r13/git'
| /disk0/pokybuild/build-multilib-x32-qemu/tmp/sysroots/x86_64-linux/usr/bin/cmake -E cmake_progress_report /disk0/pokybuild/build-multilib-x32-qemu/tmp/work/qemux86_64-poky-linux-gnux32/libzypp-0.0-git1+15b6c52260bbc52b3d8e585e271b67e10cc7c433-r13/git/CMakeFiles 93
| [  1%] Building CXX object zypp/CMakeFiles/zypp.dir/Arch.cc.o
| cd /disk0/pokybuild/build-multilib-x32-qemu/tmp/work/qemux86_64-poky-linux-gnux32/libzypp-0.0-git1+15b6c52260bbc52b3d8e585e271b67e10cc7c433-r13/git/zypp && /disk0/pokybuild/build-multilib-x32-qemu/tmp/sysroots/x86_64-linux/usr/bin/x86_64-x32-poky-linux-gnux32/x86_64-poky-linux-gnux32-g++   -Dzypp_EXPORTS -D_FILE_OFFSET_BITS=64 -DVERSION=\"8.11.0\" -D_RPM_5 -DLOCALEDIR=\"/usr/share/locale\" -DTEXTDOMAIN=\"zypp\" -mx32   --sysroot=/disk0/pokybuild/build-multilib-x32-qemu/tmp/sysroots/qemux86-64  -O2 -pipe -g -feliminate-unused-debug-types -fpermissive -fvisibility-inlines-hidden -fpermissive -fno-strict-aliasing -fPIC -g -Wall -Werror=format-security -Woverloaded-virtual -Wnon-virtual-dtor -Wl,-as-needed -fPIC -I/disk0/pokybuild/build-multilib-x32-qemu/tmp/work/qemux86_64-poky-linux-gnux32/libzypp-0.0-git1+15b6c52260bbc52b3d8e585e271b67e10cc7c433-r13/git -I/disk0/pokybuild/build-multilib-x32-qemu/tmp/sysroots/qemux86-64/usr/include -I/disk0/pokybuild/build-multilib-x32-qemu/tmp/sysroots/qemux86-64/usr/include/rpm -I/disk0/pokybuild/build-multilib-x32-qemu/tmp/sysroots/qemux86-64/usr/include/libxml2 -I/disk0/pokybuild/build-multilib-x32-qemu/tmp/work/qemux86_64-poky-linux-gnux32/libzypp-0.0-git1+15b6c52260bbc52b3d8e585e271b67e10cc7c433-r13/git/zypp    -DZYPP_BASE_LOGGER_LOGGROUP=\"zypp\" -o CMakeFiles/zypp.dir/Arch.cc.o -c /disk0/pokybuild/build-multilib-x32-qemu/tmp/work/qemux86_64-poky-linux-gnux32/libzypp-0.0-git1+15b6c52260bbc52b3d8e585e271b67e10cc7c433-r13/git/zypp/Arch.cc
| In file included from /disk0/pokybuild/build-multilib-x32-qemu/tmp/work/qemux86_64-poky-linux-gnux32/libzypp-0.0-git1+15b6c52260bbc52b3d8e585e271b67e10cc7c433-r13/git/zypp/Arch.cc:240:0:
| /disk0/pokybuild/build-multilib-x32-qemu/tmp/work/qemux86_64-poky-linux-gnux32/libzypp-0.0-git1+15b6c52260bbc52b3d8e585e271b67e10cc7c433-r13/git/zypp/oe-arch.h: In constructor 'zypp::{anonymous}::ArchCompatSet::ArchCompatSet()':
| /disk0/pokybuild/build-multilib-x32-qemu/tmp/work/qemux86_64-poky-linux-gnux32/libzypp-0.0-git1+15b6c52260bbc52b3d8e585e271b67e10cc7c433-r13/git/zypp/oe-arch.h:29:28: error: '_x86_64' was not declared in this scope
| /disk0/pokybuild/build-multilib-x32-qemu/tmp/work/qemux86_64-poky-linux-gnux32/libzypp-0.0-git1+15b6c52260bbc52b3d8e585e271b67e10cc7c433-r13/git/zypp/oe-arch.h:29:36: error: 'x32' was not declared in this scope
| In file included from /disk0/pokybuild/build-multilib-x32-qemu/tmp/work/qemux86_64-poky-linux-gnux32/libzypp-0.0-git1+15b6c52260bbc52b3d8e585e271b67e10cc7c433-r13/git/zypp/Arch.cc:339:0:
| /disk0/pokybuild/build-multilib-x32-qemu/tmp/work/qemux86_64-poky-linux-gnux32/libzypp-0.0-git1+15b6c52260bbc52b3d8e585e271b67e10cc7c433-r13/git/zypp/oe-arch.h: At global scope:
| /disk0/pokybuild/build-multilib-x32-qemu/tmp/work/qemux86_64-poky-linux-gnux32/libzypp-0.0-git1+15b6c52260bbc52b3d8e585e271b67e10cc7c433-r13/git/zypp/oe-arch.h:23:31: error: '_x86_64' was not declared in this scope
| /disk0/pokybuild/build-multilib-x32-qemu/tmp/work/qemux86_64-poky-linux-gnux32/libzypp-0.0-git1+15b6c52260bbc52b3d8e585e271b67e10cc7c433-r13/git/zypp/oe-arch.h:23:39: error: 'x32' was not declared in this scope
| make[2]: *** [zypp/CMakeFiles/zypp.dir/Arch.cc.o] Error 1
| make[2]: Leaving directory `/disk0/pokybuild/build-multilib-x32-qemu/tmp/work/qemux86_64-poky-linux-gnux32/libzypp-0.0-git1+15b6c52260bbc52b3d8e585e271b67e10cc7c433-r13/git'
| make[1]: *** [zypp/CMakeFiles/zypp.dir/all] Error 2
| make[1]: Leaving directory `/disk0/pokybuild/build-multilib-x32-qemu/tmp/work/qemux86_64-poky-linux-gnux32/libzypp-0.0-git1+15b6c52260bbc52b3d8e585e271b67e10cc7c433-r13/git'
| make: *** [all] Error 2
| ERROR: oe_runmake failed
| ERROR: Function 'do_compile' failed (see /disk0/pokybuild/build-multilib-x32-qemu/tmp/work/qemux86_64-poky-linux-gnux32/libzypp-0.0-git1+15b6c52260bbc52b3d8e585e271b67e10cc7c433-r13/temp/log.do_compile.7326 for further information)
Comment 1 Nitin Kamble 2011-12-01 12:25:40 UTC
this issues does not happen on the current x32 layer.

Nitin