Bug 1405 - x32: apt compilation fails
Summary: x32: apt compilation fails
Status: RESOLVED WORKSFORME
Alias: None
Product: OE-Core
Classification: Build System, Metadata & Runtime
Component: core (show other bugs)
Version: unspecified
Hardware: x86 x86_64
: Medium normal
Target Milestone: 1.2
Assignee: Nitin Kamble
QA Contact:
URL:
Whiteboard:
Depends on:
Blocks: 1579
  Show dependency tree
 
Reported: 2011-08-25 14:21 UTC by Nitin Kamble
Modified: 2011-12-01 12:28 UTC (History)
3 users (show)

See Also:
OS type for building Yocto: ---
Type of Regression: ---
Verified:
Documentation change: ---


Attachments

Note You need to log in before you can comment on or make changes to this bug.
Description Nitin Kamble 2011-08-25 14:21:56 UTC
ERROR: Function 'do_compile' failed (see /disk0/pokybuild/build-multilib-x32-qemu/tmp/work/x86_64-x32-poky-linux-gnux32/apt-0.7.14-r7/temp/log.do_compile.8328 for further information)
ERROR: Logfile of failure stored in: /disk0/pokybuild/build-multilib-x32-qemu/tmp/work/x86_64-x32-poky-linux-gnux32/apt-0.7.14-r7/temp/log.do_compile.8328
Log data follows:
| DEBUG: SITE files ['endian-little', 'common-linux', 'common-glibc', 'bit-32', 'ix86-common', 'x86_64-linux-gnux32', 'common']
| NOTE: make -j 16
| Compiling deb/deblistparser.cc to /disk0/pokybuild/build-multilib-x32-qemu/tmp/work/x86_64-x32-poky-linux-gnux32/apt-0.7.14-r7/apt-0.7.14/obj/apt-pkg/deblistparser.opic
| deb/deblistparser.cc: In member function 'virtual short unsigned int debListParser::VersionHash()':
| deb/deblistparser.cc:212:13: error: redeclaration of 'char* I'
| deb/deblistparser.cc:202:22: error: 'const char** I' previously declared here
| make[2]: *** [/disk0/pokybuild/build-multilib-x32-qemu/tmp/work/x86_64-x32-poky-linux-gnux32/apt-0.7.14-r7/apt-0.7.14/obj/apt-pkg/deblistparser.opic] Error 1
| make[1]: *** [all] Error 2
| make: *** [all] Error 2
| ERROR: oe_runmake failed
| ERROR: Function 'do_compile' failed (see /disk0/pokybuild/build-multilib-x32-qemu/tmp/work/x86_64-x32-poky-linux-gnux32/apt-0.7.14-r7/temp/log.do_compile.8328 for further information)
Comment 1 Nitin Kamble 2011-12-01 12:28:24 UTC
this issue does not happen on the latest meta-x32 layer.
Nitin