Bug 1408 - x32: systemtap build fails
Summary: x32: systemtap build fails
Status: RESOLVED WORKSFORME
Alias: None
Product: OE-Core
Classification: Build System, Metadata & Runtime
Component: core (show other bugs)
Version: unspecified
Hardware: x86 x86_64
: Medium normal
Target Milestone: 1.2
Assignee: Nitin Kamble
QA Contact:
URL:
Whiteboard:
Depends on:
Blocks: 1579
  Show dependency tree
 
Reported: 2011-08-25 14:28 UTC by Nitin Kamble
Modified: 2011-12-01 13:42 UTC (History)
3 users (show)

See Also:
OS type for building Yocto: ---
Type of Regression: ---
Verified:
Documentation change: ---


Attachments

Note You need to log in before you can comment on or make changes to this bug.
Description Nitin Kamble 2011-08-25 14:28:15 UTC
ERROR: Logfile of failure stored in: /disk0/pokybuild/build-multilib-x32-qemu/tmp/work/x86_64-x32-poky-linux-gnux32/systemtap-1.4+git1+4ab3a1863bf4f472acae7a809bf2b38d91658aa8-r4/temp/log.do_compile.7547
Log data follows:
| DEBUG: SITE files ['endian-little', 'common-linux', 'common-glibc', 'bit-32', 'ix86-common', 'x86_64-linux-gnux32', 'common']
| NOTE: make -j 16
| /bin/sh ./git_version.sh -k -s . -o git_version.h
| fatal: ref HEAD is not a symbolic ref
| git_version.sh: Output is unchanged, keeping git_version.h
| make  all-recursive
| make[1]: Entering directory `/disk0/pokybuild/build-multilib-x32-qemu/tmp/work/x86_64-x32-poky-linux-gnux32/systemtap-1.4+git1+4ab3a1863bf4f472acae7a809bf2b38d91658aa8-r4/git'
| Making all in .
| make[2]: Entering directory `/disk0/pokybuild/build-multilib-x32-qemu/tmp/work/x86_64-x32-poky-linux-gnux32/systemtap-1.4+git1+4ab3a1863bf4f472acae7a809bf2b38d91658aa8-r4/git'
| ccache x86_64-poky-linux-gnux32-g++   -mx32  --sysroot=/disk0/pokybuild/build-multilib-x32-qemu/tmp/sysroots/qemux86-64 -DHAVE_CONFIG_H -I.  -DBINDIR='"/usr/bin"' -DSYSCONFDIR='"/etc"' -DPKGDATADIR='"/usr/share/systemtap"' -DPKGLIBDIR='"/usr/libexec/systemtap"' -I./includes -I./includes/sys -DSTAP_SDT_V2     -Wall -Werror   -O2 -pipe -g -feliminate-unused-debug-types -fpermissive -fvisibility-inlines-hidden -Werror -fstack-protector-all -D_FORTIFY_SOURCE=2 -MT stap-session.o -MD -MP -MF .deps/stap-session.Tpo -c -o stap-session.o `test -f 'session.cxx' || echo './'`session.cxx
| The script example index is outdated, run
|     cd ./testsuite/systemtap.examples && \
|     perl examples-index-gen.pl
| to regenerate it.
| session.cxx: In member function 'void systemtap_session::register_library_aliases()':
| session.cxx:1116:32: error: redeclaration of 'match_node* n'
| session.cxx:1113:29: error: 'unsigned int n' previously declared here
| make[2]: *** [stap-session.o] Error 1
| make[2]: Leaving directory `/disk0/pokybuild/build-multilib-x32-qemu/tmp/work/x86_64-x32-poky-linux-gnux32/systemtap-1.4+git1+4ab3a1863bf4f472acae7a809bf2b38d91658aa8-r4/git'
| make[1]: *** [all-recursive] Error 1
| make[1]: Leaving directory `/disk0/pokybuild/build-multilib-x32-qemu/tmp/work/x86_64-x32-poky-linux-gnux32/systemtap-1.4+git1+4ab3a1863bf4f472acae7a809bf2b38d91658aa8-r4/git'
| make: *** [all] Error 2
| ERROR: oe_runmake failed
| ERROR: Function 'do_compile' failed (see /disk0/pokybuild/build-multilib-x32-qemu/tmp/work/x86_64-x32-poky-linux-gnux32/systemtap-1.4+git1+4ab3a1863bf4f472acae7a809bf2b38d91658aa8-r4/temp/log.do_compile.7547 for further information)
NOTE: package systemtap-1.4+git1+4ab3a1863bf4f472acae7a809bf2b38d91658aa8-r4: task do_compile: Failed
Comment 1 Nitin Kamble 2011-12-01 13:42:36 UTC
THis issue does not happen on the latest x32 layer
Nitin